{"text_format":"1","workbook":"xlsx","n_sheets":3,"sheets":["Home","Shape Limits","Data"],"not_rendered":{"charts":0,"images":23,"macros":1,"external_links":0,"defined_names":86,"comments":1,"pivot_tables":0},"unopened":[],"bounds":{"document_bytes":16777216,"sheet_cells":100000,"rows_first":2000,"rows_last":500,"rows_between":2000,"halvings":0,"cell_chars":16384,"cell_head_chars":4096},"cells_cut":0,"cells_raw":0,"read":"whole","date_system":"1900"}

{"sheet":"Home","index":0,"n_rows":18,"n_cols":14,"rows_kept":18,"cut":false,"hidden":false,"merged":[[0,11,1,13],[5,13,6,13],[14,2,14,7],[17,13,18,13],[5,11,6,11],[5,10,6,10],[17,12,18,12],[17,11,18,11],[17,10,18,10],[5,12,6,12],[16,2,16,7],[15,2,15,7],[12,3,12,6],[2,3,2,7],[7,3,7,6],[13,2,13,7]]}
[null,null,null,null,null,null,null,null,null,null,null,"Manufacturing Data"]
[]
[null,null,null,"Windows Min. Max. Look-up",null,null,null,null,null,null,1,{"$f":"VLOOKUP($K3,'Shape Limits'!$S:$U,2,FALSE)","v":{"$error":"#N/A"}},{"$f":"VLOOKUP($K3,'Shape Limits'!$S:$U,3,FALSE)","v":{"$error":"#N/A"}},{"$f":"IF((VLOOKUP($K3,'Shape Limits'!$S:$V,4,FALSE))=1,\"Z\",\"\")","v":{"$error":"#N/A"}}]
[null,null,"Model #","Min. W","Min. H","Max. W","Max. H","Max. UI",null,null,2,{"$f":"VLOOKUP($K4,'Shape Limits'!$S:$U,2,FALSE)","v":{"$error":"#N/A"}},{"$f":"VLOOKUP($K4,'Shape Limits'!$S:$U,3,FALSE)","v":{"$error":"#N/A"}},{"$f":"IF((VLOOKUP($K4,'Shape Limits'!$S:$V,4,FALSE))=1,\"Z\",\"\")","v":{"$error":"#N/A"}}]
[null,null,{"$f":"MODEL","v":""},{"$f":"MINW","v":""},{"$f":"MINH","v":""},{"$f":"MAXW","v":""},{"$f":"MAXH","v":""},{"$f":"MAXUI","v":""},null,null,3,{"$f":"VLOOKUP($K5,'Shape Limits'!$S:$U,2,FALSE)","v":{"$error":"#N/A"}},{"$f":"VLOOKUP($K5,'Shape Limits'!$S:$U,3,FALSE)","v":{"$error":"#N/A"}},{"$f":"IF((VLOOKUP($K5,'Shape Limits'!$S:$V,4,FALSE))=1,\"Z\",\"\")","v":{"$error":"#N/A"}}]
[null,null,{"$f":"NOTES","v":""},null,null,null,null,null,null,null,4,{"$f":"VLOOKUP($K6,'Shape Limits'!$S:$U,2,FALSE)","v":{"$error":"#N/A"}},{"$f":"VLOOKUP($K6,'Shape Limits'!$S:$U,3,FALSE)","v":{"$error":"#N/A"}},{"$f":"IF((VLOOKUP($K6,'Shape Limits'!$S:$V,4,FALSE))=1,\"Z\",\"\")","v":{"$error":"#N/A"}}]
[]
[null,null,null,"PW / Shapes Min. Max. Look-up",null,null,null,null,null,null,5,{"$f":"VLOOKUP($K8,'Shape Limits'!$S:$U,2,FALSE)","v":{"$error":"#N/A"}},{"$f":"VLOOKUP($K8,'Shape Limits'!$S:$U,3,FALSE)","v":{"$error":"#N/A"}},{"$f":"IF((VLOOKUP($K8,'Shape Limits'!$S:$V,4,FALSE))=1,\"Z\",\"\")","v":{"$error":"#N/A"}}]
[null,null,"Extrusion",null,"Model #",null,null,null,null,null,6,{"$f":"VLOOKUP($K9,'Shape Limits'!$S:$U,2,FALSE)","v":{"$error":"#N/A"}},{"$f":"VLOOKUP($K9,'Shape Limits'!$S:$U,3,FALSE)","v":{"$error":"#N/A"}},{"$f":"IF((VLOOKUP($K9,'Shape Limits'!$S:$V,4,FALSE))=1,\"Z\",\"\")","v":{"$error":"#N/A"}}]
[null,null,null,null,null,null,null,null,null,null,7,{"$f":"VLOOKUP($K10,'Shape Limits'!$S:$U,2,FALSE)","v":{"$error":"#N/A"}},{"$f":"VLOOKUP($K10,'Shape Limits'!$S:$U,3,FALSE)","v":{"$error":"#N/A"}},{"$f":"IF((VLOOKUP($K10,'Shape Limits'!$S:$V,4,FALSE))=1,\"Z\",\"\")","v":{"$error":"#N/A"}}]
[null,null,null,"Width","Height","Dim. 3","Dim. 4",null,null,null,8,{"$f":"VLOOKUP($K11,'Shape Limits'!$S:$U,2,FALSE)","v":{"$error":"#N/A"}},{"$f":"VLOOKUP($K11,'Shape Limits'!$S:$U,3,FALSE)","v":{"$error":"#N/A"}},{"$f":"IF((VLOOKUP($K11,'Shape Limits'!$S:$V,4,FALSE))=1,\"Z\",\"\")","v":{"$error":"#N/A"}}]
[null,null,null,null,null,null,null,null,null,null,9,{"$f":"VLOOKUP($K12,'Shape Limits'!$S:$U,2,FALSE)","v":{"$error":"#N/A"}},{"$f":"VLOOKUP($K12,'Shape Limits'!$S:$U,3,FALSE)","v":{"$error":"#N/A"}},{"$f":"IF((VLOOKUP($K12,'Shape Limits'!$S:$V,4,FALSE))=1,\"Z\",\"\")","v":{"$error":"#N/A"}}]
[null,null,null,null,null,null,null,null,null,null,10,{"$f":"VLOOKUP($K13,'Shape Limits'!$S:$U,2,FALSE)","v":{"$error":"#N/A"}},{"$f":"VLOOKUP($K13,'Shape Limits'!$S:$U,3,FALSE)","v":{"$error":"#N/A"}},{"$f":"IF((VLOOKUP($K13,'Shape Limits'!$S:$V,4,FALSE))=1,\"Z\",\"\")","v":{"$error":"#N/A"}}]
[null,null,{"$f":"IF(AND(SHAPEW>0,OFFSET=0),\"MUST SELECT EXTRUSION TYPE\",IF(AND(SHAPEW>0,MAX_IG=2),\"Glass is too large to produce\",IF(GLASS=\"\",\"TIG is not Available for this size\",\"\")))","v":""},null,null,null,null,null,null,null,11,{"$f":"VLOOKUP($K14,'Shape Limits'!$S:$U,2,FALSE)","v":{"$error":"#N/A"}},{"$f":"VLOOKUP($K14,'Shape Limits'!$S:$U,3,FALSE)","v":{"$error":"#N/A"}},{"$f":"IF((VLOOKUP($K14,'Shape Limits'!$S:$V,4,FALSE))=1,\"Z\",\"\")","v":{"$error":"#N/A"}}]
[null,null,{"$f":"IF(C14=\"TIG is not Available for this size\",\"Available IG Options: \"&GLASSOPT1&IF(AND(SHAPEW>0,GLASSOPT2>\"\"),\" OR \"&GLASSOPT2),\"\")","v":""},null,null,null,null,null,null,null,12,{"$f":"VLOOKUP($K15,'Shape Limits'!$S:$U,2,FALSE)","v":{"$error":"#N/A"}},{"$f":"VLOOKUP($K15,'Shape Limits'!$S:$U,3,FALSE)","v":{"$error":"#N/A"}},{"$f":"IF((VLOOKUP($K15,'Shape Limits'!$S:$V,4,FALSE))=1,\"Z\",\"\")","v":{"$error":"#N/A"}}]
{"$rows_left_out":4}
{"sheet":"Shape Limits","index":1,"n_rows":271,"n_cols":62,"rows_kept":271,"cut":false,"hidden":true,"merged":[[1,30,1,31],[2,35,2,36],[0,1,0,2],[0,3,0,10],[0,11,0,12],[1,28,1,29]]}
[null,{"$f":"MAX(D5,D13,D23,D32,D43,D51,D61,D74,D87,D99,D108,D120,D128,D140,D148,D161,D171,D183,D195,D207,D219,D231,D242,D252)","v":0},null,"Shapes Min. Max. Limitations",null,null,null,null,null,null,null,{"$f":"IF(O1>\"\",O1,IF(O2>\"\",O2,IF(O3>\"\",O3,IF(O4>\"\",O4,\"\"))))","v":""},null,null,{"$f":"IF($F$5>\"\",$F$5,IF($F$13>\"\",$F$13,IF($F$23>\"\",$F$23,IF($F$32>\"\",$F$32,IF($F$43>\"\",$F$43,IF($G$51>\"\",$G$51,\"\"))))))","v":""}]
[null,105,"Min R","Max W","Max UI","Max Sq.ft",null,"Frame Height:",{"$f":"IF(AND(SHAPEW>0,SHAPE=B2),SHAPEW/2,0)","v":0},null,null,null,null,null,{"$f":"IF(F61>\"\",F61,IF(G74>\"\",G74,IF(F87>\"\",F87,IF(F99>\"\",F99,IF(F108>\"\",F108,IF(F120>\"\",F120,\"\"))))))","v":""},null,null,null,null,null,null,null,null,null,null,null,null,null,"Min",null,"Max"]
[null,{"$f":"EXT","v":1},{"$f":"MIN_R","v":""},{"$f":"MAX_W","v":""},{"$f":"MAX_UI","v":""},{"$f":"MAX_SF","v":""},null,"Glass R:",{"$f":"IF(AND(SHAPEW>0,OFFSET>0,SHAPE=B2),I2-OFFSET,0)","v":0},null,null,null,null,null,{"$f":"IF(F128>\"\",F128,IF(F140>\"\",F140,IF(F148>\"\",F148,IF(F161>\"\",F161,IF(F195>\"\",F195,IF(G207>\"\",G207,\"\"))))))","v":""},null,null,null,null,null,null,null,null,null,null,null,1,"Select a Model","W","H","W","H","UI",null,null,"Shapes",null,"cut angle","Width","Height",null,null,null,null,null,null,null,null,null,null,null,"Model","Width","Height","Area",null,null,"SS (2.2)","DS (3.2)","4 mm","TS (5.0)"]
[null,null,{"$f":"IF(AND(SHAPEW>0,SHAPE=B2,(SHAPEW/2)<C3),1,0)","v":0},{"$f":"IF(AND(SHAPEW>0,OFFSET>0,SHAPE=B2,SHAPEW>D3),1,0)","v":0},{"$f":"IF(AND(SHAPEW>0,OFFSET>0,SHAPE=B2,(SHAPEW+I2)>E3),1,0)","v":0},{"$f":"IF(AND(SHAPEW>0,OFFSET>0,SHAPE=B2,((I2*SHAPEW)/144)>F3),1,0)","v":0},null,"Glass H:",{"$f":"IF(AND(SHAPEW>0,SHAPE=B2),I2-(OFFSET*2),0)","v":0},null,null,null,null,null,{"$f":"IF(G171>\"\",G171,IF(G183>\"\",G183,IF(G219>\"\",G219,IF(G231>\"\",G231,IF(F242>\"\",F242,IF(G252>\"\",G252,\"\"))))))","v":""},null,null,null,null,null,null,null,null,null,null,null,2,"3001 Comp.",12,"20",48,84,126,null,1,"Select","Select",{"$f":"IF(SHAPELINK>1,(VLOOKUP(SHAPE,AJ5:AL28,3)),\"\")","v":""},1,1,null,null,1,"Select",1,0,0,null,null,null,null,105,{"$f":"I5","v":0},{"$f":"I4","v":0},{"$f":"(BA4*BB4)/144","v":0},null,"Max. Short",{"$f":"IF(OR($BA$28>41,$BA$42>41),0,41)","v":41},{"$f":"IF(OR($BA$28>56,$BA$42>56),0,56)","v":56},{"$f":"IF(OR($BA$28>76,$BA$42>76),0,76)","v":76},{"$f":"IF(OR($BA$28>76,$BA$42>76),0,76)","v":76},"Annealed"]
[null,null,{"$f":"MAX(C4:F4)","v":0},{"$f":"IF(AND(SHAPE=B2,C5=1),1,0)","v":0},{"$f":"IF(AND(SHAPEW>0,SHAPEH>0,SHAPE=B2,SHAPEH<>(SHAPEW/2)),1,0)","v":0},{"$f":"IF(AND(SHAPE=105,E5=1),\"HEIGHT MUST BE 1/2 THE WIDTH\",IF(AND(SHAPE=105,SHAPEW>0,C4>0),\"RADIUS MUST BE GREATER THAN \"&C3,IF(AND(SHAPE=105,I5>0,I5<GlassMinW),\"Glass Width is Under Minimum\",IF(AND(SHAPE=105,I4>0,I4<GlassMinH),\"Glass Height is Under Minimum\",\"\"))))","v":""},null,"Glass W:",{"$f":"IF(AND(SHAPEW>0,SHAPE=B2,EXTRUSION=\"Mezzo\"),(2*(SQRT(I4*((2*((SHAPEW/2)-OFFSET))-I4))))-0.1875,IF(AND(SHAPEW>0,SHAPE=B2),2*(SQRT(I4*((2*((SHAPEW/2)-OFFSET))-I4))),0))","v":0},null,null,null,null,null,null,null,null,105,{"$f":"IF(AND(SHAPEW>0,SHAPE=105),1,0)","v":0},{"$f":"IF(S5>0,\"Frame Width:\",0)","v":0},{"$f":"IF(S5>0,SHAPEW,0)","v":0},null,null,"105",null,null,3,"3001 Steel",12,"20","52",96,148,null,2,105,"105 (Circle Top)",18,0,1,null,null,2,"Mezzo",3954,2.09375,2.605,null,null,null,null,110,{"$f":"J11","v":0},{"$f":"J12","v":0},{"$f":"(BA5*BB5)/144","v":0},null,"Max. Long",{"$f":"IF(OR($BB$28>62,$BB$42>62),0,62)","v":62},{"$f":"IF(OR($BB$28>76,$BB$42>76),0,76)","v":76},{"$f":"IF(OR($BB$28>110,$BB$42>110),0,110)","v":110},{"$f":"IF(OR($BB$28>110,$BB$42>110),0,110)","v":110},"Annealed"]
[null,null,null,null,null,null,null,null,null,null,null,null,null,null,null,null,null,105,{"$f":"IF(AND(SHAPEW>0,SHAPE=105),2,0)","v":0},{"$f":"IF(S6>0,\"Frame Height:\",0)","v":0},{"$f":"IF(S6>0,I2,0)","v":0},null,null,"110",null,null,4,"3002 Comp.",18.5,11.25,72,56,128,null,3,110,"110 (Circle Top w/Ex Leg)",18,0,0,null,null,3,"Mezzo w/NF","3954F",2.09375,2.605,null,null,null,null,111,{"$f":"I23","v":0},{"$f":"I23","v":0},0,null,"Max Sq.Ft.",{"$f":"IF(OR($BC$28>12,$BC$42>12),0,12)","v":12},{"$f":"IF(OR($BC$28>22,$BC$42>22),0,22)","v":22},{"$f":"IF(OR($BC$28>42,$BC$42>42),0,42)","v":42},{"$f":"IF(OR($BC$28>42,$BC$42>42),0,42)","v":42},"Annealed"]
[null,null,null,null,null,null,null,null,null,null,null,null,null,null,null,null,null,105,{"$f":"IF(AND(SHAPEW>0,SHAPE=105),3,0)","v":0},{"$f":"IF(S7>0,\"Frame Radius:\",0)","v":0},{"$f":"IF(S7>0,I2,0)","v":0},{"$f":"IF(AND(S7>0,C4>0),1,0)","v":0},null,"111",null,null,5,"3002 Steel",18.5,11.25,96,"72",156,null,4,111,"111 (Quarter Arch)",18,0,1,null,null,4,"New Construction","SH2201",1,2.1619999999999999,null,null,null,null,112,{"$f":"J32","v":0},{"$f":"J33","v":0},0,null,"Max. Short",0,{"$f":"IF(OR($BA$28>42,$BA$42>42),0,42)","v":42},{"$f":"IF(OR($BA$28>70,$BA$42>70),0,70)","v":70},{"$f":"IF(OR($BA$28>70,$BA$42>70),0,70)","v":70},"Tempered"]
[null,null,null,null,null,null,null,null,null,null,null,null,null,null,null,null,null,105,{"$f":"IF(AND(SHAPEW>0,SHAPE=105),4,0)","v":0},{"$f":"IF(S8>0,\"Glass Radius:\",0)","v":0},{"$f":"IF(S8>0,I3,0)","v":0},null,null,"112",null,null,6,"3003 Comp.",47.5,11.25,108,56,164,null,5,112,"112 (Quarter Arch w/Ex Leg)",18,0,0,null,null,5,"New Cons. Gold/Silver","V-Series",1.8125,2.25,null,null,null,null,113,{"$f":"J43","v":0},{"$f":"J42","v":0},0,null,"Max. Long",0,{"$f":"IF(OR($BB$28>84,$BB$42>84),0,84)","v":84},{"$f":"IF(OR($BB$28>129,$BB$42>129),0,129)","v":129},{"$f":"IF(OR($BB$28>129,$BB$42>129),0,129)","v":129},"Tempered"]
[null,null,null,null,null,null,null,null,null,null,null,null,null,null,null,null,null,105,{"$f":"IF(AND(SHAPEW>0,SHAPE=105),5,0)","v":0},{"$f":"IF(S9>0,\"Glass Width:\",0)","v":0},{"$f":"IF(S9>0,I5,0)","v":0},{"$f":"IF(AND(U9>0,U9<GlassMinW),1,0)","v":0},null,"113",null,null,7,"3003 Steel",47.5,11.25,120,72,"192",null,6,113,"113 (Eyebrow)",{"$f":"J44","v":0},0,0,null,null,6,"Casement/U.Maxx/8000/9000","PWFO1",1.125,1.5613999999999999,null,null,null,null,114,{"$f":"J51","v":0},{"$f":"J50","v":0},0,null,"Max Sq.Ft.",0,{"$f":"IF(OR($BC$28>24.5,$BC$42>24.5),0,24.5)","v":24.5},{"$f":"IF(OR($BC$28>42,$BC$42>42),0,42)","v":42},{"$f":"IF(OR($BC$28>42,$BC$42>42),0,42)","v":42},"Tempered"]
[null,110,"Min R","Max W","Max UI","Max H","Min Leg",null,"Frame Height:",{"$f":"IF(AND(SHAPEW>0,SHAPEH>0,SHAPE=110),SHAPEH,0)","v":0},null,null,null,null,null,null,null,105,{"$f":"IF(AND(SHAPEW>0,SHAPE=105),6,0)","v":0},{"$f":"IF(S10>0,\"Glass Height:\",0)","v":0},{"$f":"IF(S10>0,I4,0)","v":0},{"$f":"IF(AND(U10>0,U10<GlassMinH),1,0)","v":0},null,"114",null,null,8,3004,9.5,9.5,"112",112,154,null,7,114,"114 (Eyebrow w/Ex Leg)",{"$f":"J55","v":0},0,0,null,null,7,1700,"SH46",1.8125,2.25,null,null,null,null,115,{"$f":"D66","v":0},{"$f":"D65","v":0},0,null,null,{"$f":"IF(AND(BF4>0,BF5>0,BF6>0),1,0)","v":1},{"$f":"IF(AND(BG4>0,BG5>0,BG6>0),1,0)","v":1},{"$f":"IF(AND(BH4>0,BH5>0,BH6>0),1,0)","v":1},{"$f":"IF(AND(BI4>0,BI5>0,BI6>0),1,0)","v":1},{"$f":"IF(BF10>0,\"≥SS Annealed\",IF(BG10>0,\"≥DS Annealed\",IF(BI10>0,\"TS Annealed\",\"\")))","v":"≥SS Annealed"}]
[null,{"$f":"EXT","v":1},{"$f":"MIN_R","v":""},{"$f":"MAX_W","v":""},{"$f":"MAX_UI","v":""},{"$f":"MAX_H","v":""},6.25E-2,null,"Glass W:",{"$f":"IF(AND(SHAPEW>0,SHAPEH>0,OFFSET>0,SHAPE=110),SHAPEW-(OFFSET*2),0)","v":0},null,null,null,null,null,null,null,105,{"$f":"IF(AND(SHAPEW>0,SHAPE=105),7,0)","v":0},{"$f":"IF(S11>0,\"Max Width:\",0)","v":0},{"$f":"IF(S11>0,D3,0)","v":0},{"$f":"IF(AND(S11>0,SHAPEW>U11),1,0)","v":0},null,"115",null,null,9,"3009 Comp.",37.25,11.25,108,56,164,null,8,115,"115 (Half Eyebrow)",{"$f":"IF(H63<18,H63,H66)","v":0},0,0,null,null,8,1900,"SH5702",1.8125,2.6850000000000001,null,null,null,null,116,{"$f":"D79","v":0},{"$f":"D78","v":0},0,null,null,null,{"$f":"IF(AND(BG7>0,BG8>0,BG9>0),1,0)","v":1},{"$f":"IF(AND(BH7>0,BH8>0,BH9>0),1,0)","v":1},{"$f":"IF(AND(BI7>0,BI8>0,BI9>0),1,0)","v":1},{"$f":"IF(BG11>0,\"≥DS Tempered\",IF(BI11>0,\"TS Tempered\",\"\"))","v":"≥DS Tempered"}]
[null,null,{"$f":"IF(AND(SHAPEW>0,SHAPE=B10,(SHAPEW/2)<C11),1,0)","v":0},{"$f":"IF(AND(SHAPEW>0,OFFSET>0,SHAPE=B10,SHAPEW>D11),1,0)","v":0},{"$f":"IF(AND(SHAPEW>0,OFFSET>0,SHAPE=B10,(SHAPEW+SHAPEH)>E11),1,0)","v":0},{"$f":"IF(AND(SHAPEW>0,OFFSET>0,SHAPE=B10,SHAPEH>F11),1,0)","v":0},{"$f":"IF(AND(SHAPEW>0,SHAPEH>0,SHAPE=110,(SHAPEH-SHAPEW/2)<G11),1,0)","v":0},null,"Glass H:",{"$f":"IF(AND(SHAPEW>0,SHAPEH>0,OFFSET>0,SHAPE=110),SHAPEH-(OFFSET*2),0)","v":0},null,null,null,null,null,null,null,105,{"$f":"IF(AND(SHAPEW>0,SHAPE=105),8,0)","v":0},{"$f":"IF(S12>0,\"Max UI:\",0)","v":0},{"$f":"IF(S12>0,E3,0)","v":0},{"$f":"IF(AND(S12>0,F4>0),1,0)","v":0},null,"116",null,null,10,"3009 Steel",37.25,11.25,120,72,"192",null,9,116,"116 (Half Eyebrow w/Ex Leg)",{"$f":"IF(H76<18,H76,H79)","v":0},0,0,null,null,9,1901,"Pi5801",1.8125,2.6850000000000001,null,null,null,null,117,{"$f":"J91","v":0},{"$f":"J92","v":0},0,null,null,"2.5 mm","3.2 mm","4 mm","5 mm"]
[null,null,{"$f":"MAX(C12:G12)","v":0},{"$f":"IF(AND(SHAPE=B10,C13=1),1,0)","v":0},{"$f":"IF(AND(SHAPEW>0,OFFSET>0,DIM_4>0,SHAPEH>0,SHAPE=B10,(SHAPEH-DIM_4)<>(SHAPEW/2)),1,0)","v":0},{"$f":"IF(AND(SHAPE=110,E13=1),\"HEIGHT MUST BE 1/2 THE WIDTH + DIM4\",IF(AND(SHAPE=110,SHAPEW>0,C12>0),\"RADIUS MUST BE GREATER THAN \"&C11,IF(AND(SHAPE=110,J11>0,J11<GlassMinW),\"Glass Width is Under Minimum\",IF(AND(SHAPE=110,J12>0,J12<GlassMinH),\"Glass Height is Under Minimum\",\"\"))))","v":""},null,null,"Glass Leg H:",{"$f":"IF(AND(SHAPEW>0,SHAPEH>0,OFFSET>0,SHAPE=110,((SHAPEH-SHAPEW/2)-OFFSET)>0),(SHAPEH-SHAPEW/2)-OFFSET,0)","v":0},null,null,null,null,null,null,null,110,{"$f":"IF(AND(SHAPEW>0,SHAPEH>0,SHAPE=110),1,0)","v":0},{"$f":"IF(S13>0,\"Frame Width:\",0)","v":0},{"$f":"IF(S13>0,SHAPEW,0)","v":0},null,null,"117",null,null,11,"03A0 Comp.",12,22,48,78,126,null,10,117,"117 (Ellipse)",{"$f":"I88","v":0},0,0,null,null,10,"REGENCY Pi7301","PI7301",1.4375,1.86,null,null,null,null,118,{"$f":"I98","v":0},{"$f":"I99","v":0},0,null,"Max. Short",{"$f":"IF(OR($BB$28>41,$BB$42>41),0,41)","v":41},{"$f":"IF(OR($BB$28>56,$BB$42>56),0,56)","v":56},{"$f":"IF(OR($BB$28>76,$BB$42>76),0,76)","v":76},{"$f":"IF(OR($BB$28>76,$BB$42>76),0,76)","v":76},"Annealed"]
[null,null,null,null,null,null,null,null,"Glass R:",{"$f":"IF(AND(SHAPEW>0,SHAPEH>0,OFFSET>0,SHAPE=B10),(SHAPEW/2)-OFFSET,0)","v":0},null,null,null,null,null,null,null,110,{"$f":"IF(AND(SHAPEW>0,SHAPEH>0,SHAPE=110),2,0)","v":0},{"$f":"IF(S14>0,\"Frame Height:\",0)","v":0},{"$f":"IF(S14>0,J10,0)","v":0},null,null,"118",null,null,12,"03A0 Steel",12,22,52,96,148,null,11,118,"118 (Full Circle)",18,0,1,null,null,11,"I-Series",3180,1.75,2.258,null,null,null,null,119,{"$f":"U116","v":0},{"$f":"U117","v":0},0,null,"Max. Long",{"$f":"IF(OR($BA$28>62,$BA$42>62),0,62)","v":62},{"$f":"IF(OR($BA$28>76,$BA$42>76),0,76)","v":76},{"$f":"IF(OR($BA$28>110,$BA$42>110),0,110)","v":110},{"$f":"IF(OR($BA$28>110,$BA$42>110),0,110)","v":110},"Annealed"]
[null,null,null,null,null,null,null,null,null,null,null,null,null,null,null,null,null,110,{"$f":"IF(AND(SHAPEW>0,SHAPEH>0,SHAPE=110),3,0)","v":0},{"$f":"IF(S15>0,\"Frame Radius:\",0)","v":0},{"$f":"IF(S15>0,SHAPEW/2,0)","v":0},{"$f":"IF(AND(SHAPEW>0,SHAPEH>0,S15>0,C12>0),1,0)","v":0},null,"119",null,null,13,"03A2 Comp.",18.5,12,72,56,128,null,12,119,"119 (Oval)",{"$f":"D114","v":0},0,0,null,null,12,"Excalibur / Fusion",3180,1.75,2.258,null,null,null,null,120,{"$f":"J120","v":0},{"$f":"J121","v":0},0,null,"Max Sq.Ft.",{"$f":"IF(OR($BC$28>12,$BC$42>12),0,12)","v":12},{"$f":"IF(OR($BC$28>22,$BC$42>22),0,22)","v":22},{"$f":"IF(OR($BC$28>42,$BC$42>42),0,42)","v":42},{"$f":"IF(OR($BC$28>42,$BC$42>42),0,42)","v":42},"Annealed"]
{"$rows_left_out":257}
{"sheet":"Data","index":2,"n_rows":76,"n_cols":38,"rows_kept":76,"cut":false,"hidden":true,"merged":[]}
[]
[null,"Min. W","Min. H 113","Min. H 115","Max. W","Max. H","Max. UI","Max. SF","Min. R","Min. Leg","CutLength","Min. Angle",null,"Min. Width",105,110,111,112,113,114,115,116,117,118,119,120,121,122,123,124,125,126,127,128,129,130,131,132]
["SH2201",{"$f":"SH_2201","v":10},{"$f":"(TRUNC(SQRT(SHAPEW+5)*16+0.5)/16)+2","v":4.25},{"$f":"(TRUNC(SQRT(SHAPEW+5)*16+0.5)/16)+2","v":4.25},95,95,154,56,{"$f":"SH_2201","v":10},6,7.4375,8.5,null,"Mezzo",25,25,12.5,12.5,25,14,13,13,36,24,29,18,18,18,18,12,18,18,18,18,12,16,15,14]
["PWFO1",{"$f":"PWF_01","v":10},{"$f":"(TRUNC(SQRT(SHAPEW+5)*16+0.5)/16)+2.25","v":4.5},{"$f":"(TRUNC(SQRT(SHAPEW+5)*16+0.5)/16)+2.25","v":4.5},96,96,154,56,{"$f":"PWF_01","v":10},6,7.4375,8.8000000000000007,null,"Mezzo w/NF",26,26,13,13,25,14,13,13,36,24,29,18,18,18,18,12,18,18,18,18,12,16,15,14]
[3180,{"$f":"EXCAL","v":11.75},{"$f":"(TRUNC(SQRT(SHAPEW+7.25)*16+0.5)/16)+3.5","v":6.1875},{"$f":"(TRUNC(SQRT(SHAPEW+7.25)*16+0.5)/16)+3.5","v":6.1875},96,96,154,56,{"$f":"EXCAL","v":11.75},6,7.4375,12,null,"New Construction",20,20,11.5,11.5,24,12,12,12,36,20,24,16,16,16,16,12,18,18,18,18,12,16,15,14]
["PI2101",{"$f":"PI_2101","v":13.75},{"$f":"(TRUNC(SQRT(SHAPEW+7.75)*16+0.5)/16)+4.25","v":7.0625},{"$f":"(TRUNC(SQRT(SHAPEW+7.75)*16+0.5)/16)+4.25","v":7.0625},72,84,136,40,{"$f":"PI_2101","v":13.75},6,7.4375,14.3,null,"New Cons. Gold/Silver",25,25,12.5,12.5,25,14,13,13,36,24,29,18,18,18,18,12,18,18,18,18,12,16,15,14]
["V-Series",{"$f":"V_SERIES","v":12.5},{"$f":"(TRUNC(SQRT(SHAPEW+5.75)*16+0.5)/16)+3.625","v":6},6,96,96,154,56,{"$f":"V_SERIES","v":12.5},6,7.4375,10.6,null,"0700",20,20,11.5,11.5,20,12,12,12,36,20,24,16,16,16,16,12,18,18,18,18,12,16,15,14]
["SH46",{"$f":"SH_46","v":12.5},6,6,96,96,154,56,{"$f":"SH_46","v":12.5},6,7.4375,10.6,null,"Casement/U.Maxx/8000/9000",20,20,11.5,11.5,20,12,13,13,36,20,24,16,16,16,16,12,18,18,18,18,12,16,15,14]
["SH5702",{"$f":"SH_5702","v":12.5},6,6,96,96,154,56,{"$f":"SH_5702","v":12.5},6,7.4375,10.6,null,1700,25,25,12.5,12.5,25,14,13,13,36,24,29,18,18,18,18,12,18,18,18,18,12,16,15,14]
["Pi5801",{"$f":"PI_5801","v":12.5},6,6,96,96,154,56,{"$f":"PI_5801","v":12.5},6,7.4375,10.6,null,1900,25,25,12.5,12.5,25,14,13,13,36,24,29,18,18,18,18,12,18,18,18,18,12,16,15,14]
["Pi7301",{"$f":"PI_7301","v":12.5},{"$f":"(TRUNC(SQRT(SHAPEW+5.75)*16+0.5)/16)+2.875","v":5.25},{"$f":"(TRUNC(SQRT(SHAPEW+5.75)*16+0.5)/16)+2.875","v":5.25},96,96,154,56,{"$f":"PI_7301","v":12.5},6,7.4375,10.6,null,1901,25,25,12.5,12.5,25,14,13,13,36,24,29,18,18,18,18,12,18,18,18,18,12,16,15,14]
[3954,{"$f":"MEZZO","v":12.5},{"$f":"(TRUNC(SQRT(SHAPEW+7.75)*16+0.5)/16)+4.1875","v":7},{"$f":"(TRUNC(SQRT(SHAPEW+7.75)*16+0.5)/16)+4.1875","v":7},96,96,154,56,{"$f":"MEZZO","v":12.5},6,7.4375,14.3,null,"Impact 3100",27.5,27.5,13.75,null,27.5,18,null,18,null,27.5,null,null,null,16,null,null,null,null,null,null,12,16]
["3954F",{"$f":"MEZZO","v":12.5},{"$f":"(TRUNC(SQRT(SHAPEW+7.75)*16+0.5)/16)+4.1875","v":7},{"$f":"(TRUNC(SQRT(SHAPEW+7.75)*16+0.5)/16)+4.1875","v":7},96,96,154,56,{"$f":"MEZZONF","v":13},6,7.4375,14.3,null,"REGENCY Pi7301",25,25,12.5,12.5,25,14,13,13,36,24,29,18,18,18,18,12,18,18,18,18,12,16,15,14]
[null,{"$f":"IF(EXT=1,\"\",VLOOKUP(SHAPE,MINMAXTABLE,2,FALSE))","v":""},{"$f":"IF(EXT=1,\"\",VLOOKUP(SHAPE,MINMAXTABLE,3,FALSE))","v":""},{"$f":"IF(EXT=1,\"\",VLOOKUP(SHAPE,MINMAXTABLE,3,FALSE))","v":""},{"$f":"IF(EXT=1,\"\",VLOOKUP(SHAPE,MINMAXTABLE,4,FALSE))","v":""},{"$f":"IF(EXT=1,\"\",VLOOKUP(SHAPE,MINMAXTABLE,5,FALSE))","v":""},{"$f":"IF(EXT=1,\"\",VLOOKUP(SHAPE,MINMAXTABLE,6,FALSE))","v":""},{"$f":"IF(EXT=1,\"\",VLOOKUP(EXT,DATA,8,FALSE))","v":""},{"$f":"IF(EXT=1,\"\",VLOOKUP(EXT,DATA,9,FALSE))","v":""},{"$f":"IF(EXT=1,\"\",VLOOKUP(EXT,DATA,10,FALSE))","v":""},{"$f":"IF(EXT=1,\"\",VLOOKUP(EXT,DATA,11,FALSE))","v":""},{"$f":"IF(EXT=1,\"\",VLOOKUP(EXT,DATA,12,FALSE))","v":""},null,"I-Series",23.5,23.5,12,null,23.5,18,null,18,null,23.5,null,null,null,16,null,null,null,null,null,null,12,16]
[null,null,null,null,null,null,null,null,null,null,null,null,null,"Excalibur / Fusion",23.5,23.5,12,12,23.5,18,12,12,36,23.5,24,16,16,16,16,12,16,16,16,18,12,16,15,14]
{"$rows_left_out":61}