{"text_format":"1","workbook":"xlsx","n_sheets":3,"sheets":["Home","Shape Limits","Data"],"not_rendered":{"charts":0,"images":23,"macros":1,"external_links":0,"defined_names":86,"comments":1,"pivot_tables":0},"unopened":[],"bounds":{"document_bytes":16777216,"sheet_cells":100000,"rows_first":2000,"rows_last":500,"rows_between":2000,"halvings":0,"cell_chars":16384,"cell_head_chars":4096},"cells_cut":0,"cells_raw":0,"read":"whole","date_system":"1900"}

{"sheet":"Home","index":0,"n_rows":18,"n_cols":14,"rows_kept":18,"cut":false,"hidden":false,"merged":[[0,11,1,13],[5,13,6,13],[14,2,14,7],[17,13,18,13],[5,11,6,11],[5,10,6,10],[17,12,18,12],[17,11,18,11],[17,10,18,10],[5,12,6,12],[16,2,16,7],[15,2,15,7],[12,3,12,6],[2,3,2,7],[7,3,7,6],[13,2,13,7]]}
[null,null,null,null,null,null,null,null,null,null,null,"Manufacturing Data"]
[]
[null,null,null,"Windows Min. Max. Look-up",null,null,null,null,null,null,1,{"$f":"VLOOKUP($K3,'Shape Limits'!$S:$U,2,FALSE)","v":{"$error":"#N/A"}},{"$f":"VLOOKUP($K3,'Shape Limits'!$S:$U,3,FALSE)","v":{"$error":"#N/A"}},{"$f":"IF((VLOOKUP($K3,'Shape Limits'!$S:$V,4,FALSE))=1,\"Z\",\"\")","v":{"$error":"#N/A"}}]
[null,null,"Model #","Min. W","Min. H","Max. W","Max. H","Max. UI",null,null,2,{"$f":"VLOOKUP($K4,'Shape Limits'!$S:$U,2,FALSE)","v":{"$error":"#N/A"}},{"$f":"VLOOKUP($K4,'Shape Limits'!$S:$U,3,FALSE)","v":{"$error":"#N/A"}},{"$f":"IF((VLOOKUP($K4,'Shape Limits'!$S:$V,4,FALSE))=1,\"Z\",\"\")","v":{"$error":"#N/A"}}]
[null,null,{"$f":"MODEL","v":""},{"$f":"MINW","v":""},{"$f":"MINH","v":""},{"$f":"MAXW","v":""},{"$f":"MAXH","v":""},{"$f":"MAXUI","v":""},null,null,3,{"$f":"VLOOKUP($K5,'Shape Limits'!$S:$U,2,FALSE)","v":{"$error":"#N/A"}},{"$f":"VLOOKUP($K5,'Shape Limits'!$S:$U,3,FALSE)","v":{"$error":"#N/A"}},{"$f":"IF((VLOOKUP($K5,'Shape Limits'!$S:$V,4,FALSE))=1,\"Z\",\"\")","v":{"$error":"#N/A"}}]
[null,null,{"$f":"NOTES","v":""},null,null,null,null,null,null,null,4,{"$f":"VLOOKUP($K6,'Shape Limits'!$S:$U,2,FALSE)","v":{"$error":"#N/A"}},{"$f":"VLOOKUP($K6,'Shape Limits'!$S:$U,3,FALSE)","v":{"$error":"#N/A"}},{"$f":"IF((VLOOKUP($K6,'Shape Limits'!$S:$V,4,FALSE))=1,\"Z\",\"\")","v":{"$error":"#N/A"}}]
[]
[null,null,null,"PW / Shapes Min. Max. Look-up",null,null,null,null,null,null,5,{"$f":"VLOOKUP($K8,'Shape Limits'!$S:$U,2,FALSE)","v":{"$error":"#N/A"}},{"$f":"VLOOKUP($K8,'Shape Limits'!$S:$U,3,FALSE)","v":{"$error":"#N/A"}},{"$f":"IF((VLOOKUP($K8,'Shape Limits'!$S:$V,4,FALSE))=1,\"Z\",\"\")","v":{"$error":"#N/A"}}]
[null,null,"Extrusion",null,"Model #",null,null,null,null,null,6,{"$f":"VLOOKUP($K9,'Shape Limits'!$S:$U,2,FALSE)","v":{"$error":"#N/A"}},{"$f":"VLOOKUP($K9,'Shape Limits'!$S:$U,3,FALSE)","v":{"$error":"#N/A"}},{"$f":"IF((VLOOKUP($K9,'Shape Limits'!$S:$V,4,FALSE))=1,\"Z\",\"\")","v":{"$error":"#N/A"}}]
[null,null,null,null,null,null,null,null,null,null,7,{"$f":"VLOOKUP($K10,'Shape Limits'!$S:$U,2,FALSE)","v":{"$error":"#N/A"}},{"$f":"VLOOKUP($K10,'Shape Limits'!$S:$U,3,FALSE)","v":{"$error":"#N/A"}},{"$f":"IF((VLOOKUP($K10,'Shape Limits'!$S:$V,4,FALSE))=1,\"Z\",\"\")","v":{"$error":"#N/A"}}]
[null,null,null,"Width","Height","Dim. 3","Dim. 4",null,null,null,8,{"$f":"VLOOKUP($K11,'Shape Limits'!$S:$U,2,FALSE)","v":{"$error":"#N/A"}},{"$f":"VLOOKUP($K11,'Shape Limits'!$S:$U,3,FALSE)","v":{"$error":"#N/A"}},{"$f":"IF((VLOOKUP($K11,'Shape Limits'!$S:$V,4,FALSE))=1,\"Z\",\"\")","v":{"$error":"#N/A"}}]
[null,null,null,null,null,null,null,null,null,null,9,{"$f":"VLOOKUP($K12,'Shape Limits'!$S:$U,2,FALSE)","v":{"$error":"#N/A"}},{"$f":"VLOOKUP($K12,'Shape Limits'!$S:$U,3,FALSE)","v":{"$error":"#N/A"}},{"$f":"IF((VLOOKUP($K12,'Shape Limits'!$S:$V,4,FALSE))=1,\"Z\",\"\")","v":{"$error":"#N/A"}}]
[null,null,null,null,null,null,null,null,null,null,10,{"$f":"VLOOKUP($K13,'Shape Limits'!$S:$U,2,FALSE)","v":{"$error":"#N/A"}},{"$f":"VLOOKUP($K13,'Shape Limits'!$S:$U,3,FALSE)","v":{"$error":"#N/A"}},{"$f":"IF((VLOOKUP($K13,'Shape Limits'!$S:$V,4,FALSE))=1,\"Z\",\"\")","v":{"$error":"#N/A"}}]
[null,null,{"$f":"IF(AND(SHAPEW>0,OFFSET=0),\"MUST SELECT EXTRUSION TYPE\",IF(AND(SHAPEW>0,MAX_IG=2),\"Glass is too large to produce\",IF(GLASS=\"\",\"TIG is not Available for this size\",\"\")))","v":""},null,null,null,null,null,null,null,11,{"$f":"VLOOKUP($K14,'Shape Limits'!$S:$U,2,FALSE)","v":{"$error":"#N/A"}},{"$f":"VLOOKUP($K14,'Shape Limits'!$S:$U,3,FALSE)","v":{"$error":"#N/A"}},{"$f":"IF((VLOOKUP($K14,'Shape Limits'!$S:$V,4,FALSE))=1,\"Z\",\"\")","v":{"$error":"#N/A"}}]
[null,null,{"$f":"IF(C14=\"TIG is not Available for this size\",\"Available IG Options: \"&GLASSOPT1&IF(AND(SHAPEW>0,GLASSOPT2>\"\"),\" OR \"&GLASSOPT2),\"\")","v":""},null,null,null,null,null,null,null,12,{"$f":"VLOOKUP($K15,'Shape Limits'!$S:$U,2,FALSE)","v":{"$error":"#N/A"}},{"$f":"VLOOKUP($K15,'Shape Limits'!$S:$U,3,FALSE)","v":{"$error":"#N/A"}},{"$f":"IF((VLOOKUP($K15,'Shape Limits'!$S:$V,4,FALSE))=1,\"Z\",\"\")","v":{"$error":"#N/A"}}]
[null,null,{"$f":"IF(AND(RADIUS>\"\",PWSELECT=1),RADIUS,IF(AND(SHAPEW>0,SHAPELIMIT>0,EXT>1,PWSELECT=1),\"SIZE IS OUTSIDE LIMITATION\",\"\"))","v":""},null,null,null,null,null,null,null,13,{"$f":"VLOOKUP($K16,'Shape Limits'!$S:$U,2,FALSE)","v":{"$error":"#N/A"}},{"$f":"VLOOKUP($K16,'Shape Limits'!$S:$U,3,FALSE)","v":{"$error":"#N/A"}},{"$f":"IF((VLOOKUP($K16,'Shape Limits'!$S:$V,4,FALSE))=1,\"Z\",\"\")","v":{"$error":"#N/A"}}]
[null,null,{"$f":"IF(AND(SHAPELINK>1,SHAPEW>0,SHAPEH>0,EXTLINK=10,ANGLE<18),\"BRICKMOLD IS NOT AVAILABLE FOR THIS SIZE\",\"\")","v":""},null,null,null,null,null,null,null,14,{"$f":"VLOOKUP($K17,'Shape Limits'!$S:$U,2,FALSE)","v":{"$error":"#N/A"}},{"$f":"VLOOKUP($K17,'Shape Limits'!$S:$U,3,FALSE)","v":{"$error":"#N/A"}},{"$f":"IF((VLOOKUP($K17,'Shape Limits'!$S:$V,4,FALSE))=1,\"Z\",\"\")","v":{"$error":"#N/A"}}]
[null,null,null,null,null,null,null,null,null,null,15,{"$f":"VLOOKUP($K18,'Shape Limits'!$S:$U,2,FALSE)","v":{"$error":"#N/A"}},{"$f":"VLOOKUP($K18,'Shape Limits'!$S:$U,3,FALSE)","v":{"$error":"#N/A"}},{"$f":"IF((VLOOKUP($K18,'Shape Limits'!$S:$V,4,FALSE))=1,\"Z\",\"\")","v":{"$error":"#N/A"}}]

{"sheet":"Shape Limits","index":1,"n_rows":271,"n_cols":62,"rows_kept":271,"cut":false,"hidden":true,"merged":[[1,30,1,31],[2,35,2,36],[0,1,0,2],[0,3,0,10],[0,11,0,12],[1,28,1,29]]}
[null,{"$f":"MAX(D5,D13,D23,D32,D43,D51,D61,D74,D87,D99,D108,D120,D128,D140,D148,D161,D171,D183,D195,D207,D219,D231,D242,D252)","v":0},null,"Shapes Min. Max. Limitations",null,null,null,null,null,null,null,{"$f":"IF(O1>\"\",O1,IF(O2>\"\",O2,IF(O3>\"\",O3,IF(O4>\"\",O4,\"\"))))","v":""},null,null,{"$f":"IF($F$5>\"\",$F$5,IF($F$13>\"\",$F$13,IF($F$23>\"\",$F$23,IF($F$32>\"\",$F$32,IF($F$43>\"\",$F$43,IF($G$51>\"\",$G$51,\"\"))))))","v":""}]
[null,105,"Min R","Max W","Max UI","Max Sq.ft",null,"Frame Height:",{"$f":"IF(AND(SHAPEW>0,SHAPE=B2),SHAPEW/2,0)","v":0},null,null,null,null,null,{"$f":"IF(F61>\"\",F61,IF(G74>\"\",G74,IF(F87>\"\",F87,IF(F99>\"\",F99,IF(F108>\"\",F108,IF(F120>\"\",F120,\"\"))))))","v":""},null,null,null,null,null,null,null,null,null,null,null,null,null,"Min",null,"Max"]
[null,{"$f":"EXT","v":1},{"$f":"MIN_R","v":""},{"$f":"MAX_W","v":""},{"$f":"MAX_UI","v":""},{"$f":"MAX_SF","v":""},null,"Glass R:",{"$f":"IF(AND(SHAPEW>0,OFFSET>0,SHAPE=B2),I2-OFFSET,0)","v":0},null,null,null,null,null,{"$f":"IF(F128>\"\",F128,IF(F140>\"\",F140,IF(F148>\"\",F148,IF(F161>\"\",F161,IF(F195>\"\",F195,IF(G207>\"\",G207,\"\"))))))","v":""},null,null,null,null,null,null,null,null,null,null,null,1,"Select a Model","W","H","W","H","UI",null,null,"Shapes",null,"cut angle","Width","Height",null,null,null,null,null,null,null,null,null,null,null,"Model","Width","Height","Area",null,null,"SS (2.2)","DS (3.2)","4 mm","TS (5.0)"]
[null,null,{"$f":"IF(AND(SHAPEW>0,SHAPE=B2,(SHAPEW/2)<C3),1,0)","v":0},{"$f":"IF(AND(SHAPEW>0,OFFSET>0,SHAPE=B2,SHAPEW>D3),1,0)","v":0},{"$f":"IF(AND(SHAPEW>0,OFFSET>0,SHAPE=B2,(SHAPEW+I2)>E3),1,0)","v":0},{"$f":"IF(AND(SHAPEW>0,OFFSET>0,SHAPE=B2,((I2*SHAPEW)/144)>F3),1,0)","v":0},null,"Glass H:",{"$f":"IF(AND(SHAPEW>0,SHAPE=B2),I2-(OFFSET*2),0)","v":0},null,null,null,null,null,{"$f":"IF(G171>\"\",G171,IF(G183>\"\",G183,IF(G219>\"\",G219,IF(G231>\"\",G231,IF(F242>\"\",F242,IF(G252>\"\",G252,\"\"))))))","v":""},null,null,null,null,null,null,null,null,null,null,null,2,"3001 Comp.",12,"20",48,84,126,null,1,"Select","Select",{"$f":"IF(SHAPELINK>1,(VLOOKUP(SHAPE,AJ5:AL28,3)),\"\")","v":""},1,1,null,null,1,"Select",1,0,0,null,null,null,null,105,{"$f":"I5","v":0},{"$f":"I4","v":0},{"$f":"(BA4*BB4)/144","v":0},null,"Max. Short",{"$f":"IF(OR($BA$28>41,$BA$42>41),0,41)","v":41},{"$f":"IF(OR($BA$28>56,$BA$42>56),0,56)","v":56},{"$f":"IF(OR($BA$28>76,$BA$42>76),0,76)","v":76},{"$f":"IF(OR($BA$28>76,$BA$42>76),0,76)","v":76},"Annealed"]
[null,null,{"$f":"MAX(C4:F4)","v":0},{"$f":"IF(AND(SHAPE=B2,C5=1),1,0)","v":0},{"$f":"IF(AND(SHAPEW>0,SHAPEH>0,SHAPE=B2,SHAPEH<>(SHAPEW/2)),1,0)","v":0},{"$f":"IF(AND(SHAPE=105,E5=1),\"HEIGHT MUST BE 1/2 THE WIDTH\",IF(AND(SHAPE=105,SHAPEW>0,C4>0),\"RADIUS MUST BE GREATER THAN \"&C3,IF(AND(SHAPE=105,I5>0,I5<GlassMinW),\"Glass Width is Under Minimum\",IF(AND(SHAPE=105,I4>0,I4<GlassMinH),\"Glass Height is Under Minimum\",\"\"))))","v":""},null,"Glass W:",{"$f":"IF(AND(SHAPEW>0,SHAPE=B2,EXTRUSION=\"Mezzo\"),(2*(SQRT(I4*((2*((SHAPEW/2)-OFFSET))-I4))))-0.1875,IF(AND(SHAPEW>0,SHAPE=B2),2*(SQRT(I4*((2*((SHAPEW/2)-OFFSET))-I4))),0))","v":0},null,null,null,null,null,null,null,null,105,{"$f":"IF(AND(SHAPEW>0,SHAPE=105),1,0)","v":0},{"$f":"IF(S5>0,\"Frame Width:\",0)","v":0},{"$f":"IF(S5>0,SHAPEW,0)","v":0},null,null,"105",null,null,3,"3001 Steel",12,"20","52",96,148,null,2,105,"105 (Circle Top)",18,0,1,null,null,2,"Mezzo",3954,2.09375,2.605,null,null,null,null,110,{"$f":"J11","v":0},{"$f":"J12","v":0},{"$f":"(BA5*BB5)/144","v":0},null,"Max. Long",{"$f":"IF(OR($BB$28>62,$BB$42>62),0,62)","v":62},{"$f":"IF(OR($BB$28>76,$BB$42>76),0,76)","v":76},{"$f":"IF(OR($BB$28>110,$BB$42>110),0,110)","v":110},{"$f":"IF(OR($BB$28>110,$BB$42>110),0,110)","v":110},"Annealed"]
[null,null,null,null,null,null,null,null,null,null,null,null,null,null,null,null,null,105,{"$f":"IF(AND(SHAPEW>0,SHAPE=105),2,0)","v":0},{"$f":"IF(S6>0,\"Frame Height:\",0)","v":0},{"$f":"IF(S6>0,I2,0)","v":0},null,null,"110",null,null,4,"3002 Comp.",18.5,11.25,72,56,128,null,3,110,"110 (Circle Top w/Ex Leg)",18,0,0,null,null,3,"Mezzo w/NF","3954F",2.09375,2.605,null,null,null,null,111,{"$f":"I23","v":0},{"$f":"I23","v":0},0,null,"Max Sq.Ft.",{"$f":"IF(OR($BC$28>12,$BC$42>12),0,12)","v":12},{"$f":"IF(OR($BC$28>22,$BC$42>22),0,22)","v":22},{"$f":"IF(OR($BC$28>42,$BC$42>42),0,42)","v":42},{"$f":"IF(OR($BC$28>42,$BC$42>42),0,42)","v":42},"Annealed"]
[null,null,null,null,null,null,null,null,null,null,null,null,null,null,null,null,null,105,{"$f":"IF(AND(SHAPEW>0,SHAPE=105),3,0)","v":0},{"$f":"IF(S7>0,\"Frame Radius:\",0)","v":0},{"$f":"IF(S7>0,I2,0)","v":0},{"$f":"IF(AND(S7>0,C4>0),1,0)","v":0},null,"111",null,null,5,"3002 Steel",18.5,11.25,96,"72",156,null,4,111,"111 (Quarter Arch)",18,0,1,null,null,4,"New Construction","SH2201",1,2.1619999999999999,null,null,null,null,112,{"$f":"J32","v":0},{"$f":"J33","v":0},0,null,"Max. Short",0,{"$f":"IF(OR($BA$28>42,$BA$42>42),0,42)","v":42},{"$f":"IF(OR($BA$28>70,$BA$42>70),0,70)","v":70},{"$f":"IF(OR($BA$28>70,$BA$42>70),0,70)","v":70},"Tempered"]
[null,null,null,null,null,null,null,null,null,null,null,null,null,null,null,null,null,105,{"$f":"IF(AND(SHAPEW>0,SHAPE=105),4,0)","v":0},{"$f":"IF(S8>0,\"Glass Radius:\",0)","v":0},{"$f":"IF(S8>0,I3,0)","v":0},null,null,"112",null,null,6,"3003 Comp.",47.5,11.25,108,56,164,null,5,112,"112 (Quarter Arch w/Ex Leg)",18,0,0,null,null,5,"New Cons. Gold/Silver","V-Series",1.8125,2.25,null,null,null,null,113,{"$f":"J43","v":0},{"$f":"J42","v":0},0,null,"Max. Long",0,{"$f":"IF(OR($BB$28>84,$BB$42>84),0,84)","v":84},{"$f":"IF(OR($BB$28>129,$BB$42>129),0,129)","v":129},{"$f":"IF(OR($BB$28>129,$BB$42>129),0,129)","v":129},"Tempered"]
[null,null,null,null,null,null,null,null,null,null,null,null,null,null,null,null,null,105,{"$f":"IF(AND(SHAPEW>0,SHAPE=105),5,0)","v":0},{"$f":"IF(S9>0,\"Glass Width:\",0)","v":0},{"$f":"IF(S9>0,I5,0)","v":0},{"$f":"IF(AND(U9>0,U9<GlassMinW),1,0)","v":0},null,"113",null,null,7,"3003 Steel",47.5,11.25,120,72,"192",null,6,113,"113 (Eyebrow)",{"$f":"J44","v":0},0,0,null,null,6,"Casement/U.Maxx/8000/9000","PWFO1",1.125,1.5613999999999999,null,null,null,null,114,{"$f":"J51","v":0},{"$f":"J50","v":0},0,null,"Max Sq.Ft.",0,{"$f":"IF(OR($BC$28>24.5,$BC$42>24.5),0,24.5)","v":24.5},{"$f":"IF(OR($BC$28>42,$BC$42>42),0,42)","v":42},{"$f":"IF(OR($BC$28>42,$BC$42>42),0,42)","v":42},"Tempered"]
[null,110,"Min R","Max W","Max UI","Max H","Min Leg",null,"Frame Height:",{"$f":"IF(AND(SHAPEW>0,SHAPEH>0,SHAPE=110),SHAPEH,0)","v":0},null,null,null,null,null,null,null,105,{"$f":"IF(AND(SHAPEW>0,SHAPE=105),6,0)","v":0},{"$f":"IF(S10>0,\"Glass Height:\",0)","v":0},{"$f":"IF(S10>0,I4,0)","v":0},{"$f":"IF(AND(U10>0,U10<GlassMinH),1,0)","v":0},null,"114",null,null,8,3004,9.5,9.5,"112",112,154,null,7,114,"114 (Eyebrow w/Ex Leg)",{"$f":"J55","v":0},0,0,null,null,7,1700,"SH46",1.8125,2.25,null,null,null,null,115,{"$f":"D66","v":0},{"$f":"D65","v":0},0,null,null,{"$f":"IF(AND(BF4>0,BF5>0,BF6>0),1,0)","v":1},{"$f":"IF(AND(BG4>0,BG5>0,BG6>0),1,0)","v":1},{"$f":"IF(AND(BH4>0,BH5>0,BH6>0),1,0)","v":1},{"$f":"IF(AND(BI4>0,BI5>0,BI6>0),1,0)","v":1},{"$f":"IF(BF10>0,\"≥SS Annealed\",IF(BG10>0,\"≥DS Annealed\",IF(BI10>0,\"TS Annealed\",\"\")))","v":"≥SS Annealed"}]
[null,{"$f":"EXT","v":1},{"$f":"MIN_R","v":""},{"$f":"MAX_W","v":""},{"$f":"MAX_UI","v":""},{"$f":"MAX_H","v":""},6.25E-2,null,"Glass W:",{"$f":"IF(AND(SHAPEW>0,SHAPEH>0,OFFSET>0,SHAPE=110),SHAPEW-(OFFSET*2),0)","v":0},null,null,null,null,null,null,null,105,{"$f":"IF(AND(SHAPEW>0,SHAPE=105),7,0)","v":0},{"$f":"IF(S11>0,\"Max Width:\",0)","v":0},{"$f":"IF(S11>0,D3,0)","v":0},{"$f":"IF(AND(S11>0,SHAPEW>U11),1,0)","v":0},null,"115",null,null,9,"3009 Comp.",37.25,11.25,108,56,164,null,8,115,"115 (Half Eyebrow)",{"$f":"IF(H63<18,H63,H66)","v":0},0,0,null,null,8,1900,"SH5702",1.8125,2.6850000000000001,null,null,null,null,116,{"$f":"D79","v":0},{"$f":"D78","v":0},0,null,null,null,{"$f":"IF(AND(BG7>0,BG8>0,BG9>0),1,0)","v":1},{"$f":"IF(AND(BH7>0,BH8>0,BH9>0),1,0)","v":1},{"$f":"IF(AND(BI7>0,BI8>0,BI9>0),1,0)","v":1},{"$f":"IF(BG11>0,\"≥DS Tempered\",IF(BI11>0,\"TS Tempered\",\"\"))","v":"≥DS Tempered"}]
[null,null,{"$f":"IF(AND(SHAPEW>0,SHAPE=B10,(SHAPEW/2)<C11),1,0)","v":0},{"$f":"IF(AND(SHAPEW>0,OFFSET>0,SHAPE=B10,SHAPEW>D11),1,0)","v":0},{"$f":"IF(AND(SHAPEW>0,OFFSET>0,SHAPE=B10,(SHAPEW+SHAPEH)>E11),1,0)","v":0},{"$f":"IF(AND(SHAPEW>0,OFFSET>0,SHAPE=B10,SHAPEH>F11),1,0)","v":0},{"$f":"IF(AND(SHAPEW>0,SHAPEH>0,SHAPE=110,(SHAPEH-SHAPEW/2)<G11),1,0)","v":0},null,"Glass H:",{"$f":"IF(AND(SHAPEW>0,SHAPEH>0,OFFSET>0,SHAPE=110),SHAPEH-(OFFSET*2),0)","v":0},null,null,null,null,null,null,null,105,{"$f":"IF(AND(SHAPEW>0,SHAPE=105),8,0)","v":0},{"$f":"IF(S12>0,\"Max UI:\",0)","v":0},{"$f":"IF(S12>0,E3,0)","v":0},{"$f":"IF(AND(S12>0,F4>0),1,0)","v":0},null,"116",null,null,10,"3009 Steel",37.25,11.25,120,72,"192",null,9,116,"116 (Half Eyebrow w/Ex Leg)",{"$f":"IF(H76<18,H76,H79)","v":0},0,0,null,null,9,1901,"Pi5801",1.8125,2.6850000000000001,null,null,null,null,117,{"$f":"J91","v":0},{"$f":"J92","v":0},0,null,null,"2.5 mm","3.2 mm","4 mm","5 mm"]
[null,null,{"$f":"MAX(C12:G12)","v":0},{"$f":"IF(AND(SHAPE=B10,C13=1),1,0)","v":0},{"$f":"IF(AND(SHAPEW>0,OFFSET>0,DIM_4>0,SHAPEH>0,SHAPE=B10,(SHAPEH-DIM_4)<>(SHAPEW/2)),1,0)","v":0},{"$f":"IF(AND(SHAPE=110,E13=1),\"HEIGHT MUST BE 1/2 THE WIDTH + DIM4\",IF(AND(SHAPE=110,SHAPEW>0,C12>0),\"RADIUS MUST BE GREATER THAN \"&C11,IF(AND(SHAPE=110,J11>0,J11<GlassMinW),\"Glass Width is Under Minimum\",IF(AND(SHAPE=110,J12>0,J12<GlassMinH),\"Glass Height is Under Minimum\",\"\"))))","v":""},null,null,"Glass Leg H:",{"$f":"IF(AND(SHAPEW>0,SHAPEH>0,OFFSET>0,SHAPE=110,((SHAPEH-SHAPEW/2)-OFFSET)>0),(SHAPEH-SHAPEW/2)-OFFSET,0)","v":0},null,null,null,null,null,null,null,110,{"$f":"IF(AND(SHAPEW>0,SHAPEH>0,SHAPE=110),1,0)","v":0},{"$f":"IF(S13>0,\"Frame Width:\",0)","v":0},{"$f":"IF(S13>0,SHAPEW,0)","v":0},null,null,"117",null,null,11,"03A0 Comp.",12,22,48,78,126,null,10,117,"117 (Ellipse)",{"$f":"I88","v":0},0,0,null,null,10,"REGENCY Pi7301","PI7301",1.4375,1.86,null,null,null,null,118,{"$f":"I98","v":0},{"$f":"I99","v":0},0,null,"Max. Short",{"$f":"IF(OR($BB$28>41,$BB$42>41),0,41)","v":41},{"$f":"IF(OR($BB$28>56,$BB$42>56),0,56)","v":56},{"$f":"IF(OR($BB$28>76,$BB$42>76),0,76)","v":76},{"$f":"IF(OR($BB$28>76,$BB$42>76),0,76)","v":76},"Annealed"]
[null,null,null,null,null,null,null,null,"Glass R:",{"$f":"IF(AND(SHAPEW>0,SHAPEH>0,OFFSET>0,SHAPE=B10),(SHAPEW/2)-OFFSET,0)","v":0},null,null,null,null,null,null,null,110,{"$f":"IF(AND(SHAPEW>0,SHAPEH>0,SHAPE=110),2,0)","v":0},{"$f":"IF(S14>0,\"Frame Height:\",0)","v":0},{"$f":"IF(S14>0,J10,0)","v":0},null,null,"118",null,null,12,"03A0 Steel",12,22,52,96,148,null,11,118,"118 (Full Circle)",18,0,1,null,null,11,"I-Series",3180,1.75,2.258,null,null,null,null,119,{"$f":"U116","v":0},{"$f":"U117","v":0},0,null,"Max. Long",{"$f":"IF(OR($BA$28>62,$BA$42>62),0,62)","v":62},{"$f":"IF(OR($BA$28>76,$BA$42>76),0,76)","v":76},{"$f":"IF(OR($BA$28>110,$BA$42>110),0,110)","v":110},{"$f":"IF(OR($BA$28>110,$BA$42>110),0,110)","v":110},"Annealed"]
[null,null,null,null,null,null,null,null,null,null,null,null,null,null,null,null,null,110,{"$f":"IF(AND(SHAPEW>0,SHAPEH>0,SHAPE=110),3,0)","v":0},{"$f":"IF(S15>0,\"Frame Radius:\",0)","v":0},{"$f":"IF(S15>0,SHAPEW/2,0)","v":0},{"$f":"IF(AND(SHAPEW>0,SHAPEH>0,S15>0,C12>0),1,0)","v":0},null,"119",null,null,13,"03A2 Comp.",18.5,12,72,56,128,null,12,119,"119 (Oval)",{"$f":"D114","v":0},0,0,null,null,12,"Excalibur / Fusion",3180,1.75,2.258,null,null,null,null,120,{"$f":"J120","v":0},{"$f":"J121","v":0},0,null,"Max Sq.Ft.",{"$f":"IF(OR($BC$28>12,$BC$42>12),0,12)","v":12},{"$f":"IF(OR($BC$28>22,$BC$42>22),0,22)","v":22},{"$f":"IF(OR($BC$28>42,$BC$42>42),0,42)","v":42},{"$f":"IF(OR($BC$28>42,$BC$42>42),0,42)","v":42},"Annealed"]
[null,null,null,null,null,null,null,null,null,null,null,null,null,null,null,null,null,110,{"$f":"IF(AND(SHAPEW>0,SHAPEH>0,SHAPE=110),4,0)","v":0},{"$f":"IF(S16>0,\"Frame Leg:\",0)","v":0},{"$f":"IF(S16>0,SHAPEH-SHAPEW/2,0)","v":0},{"$f":"IF(AND(SHAPEW>0,SHAPEH>0,S20>0,G12>0),1,0)","v":0},null,"120",null,null,14,"03A2 Steel",18.5,12,96,72,156,null,13,120,"120 (Hexagon)",18,0,1,null,null,13,"0700","SH2201",1,1.5369999999999999,null,null,null,null,121,{"$f":"G130","v":0},{"$f":"G131","v":0},0,null,"Max. Short",0,{"$f":"IF(OR($BB$28>42,$BB$42>42),0,42)","v":42},{"$f":"IF(OR($BB$28>70,$BB$42>70),0,70)","v":70},{"$f":"IF(OR($BB$28>70,$BB$42>70),0,70)","v":70},"Tempered"]
[null,null,null,null,null,null,null,null,null,null,null,null,null,null,null,null,null,110,{"$f":"IF(AND(SHAPEW>0,SHAPEH>0,SHAPE=110),5,0)","v":0},{"$f":"IF(S17>0,\"Glass Radius:\",0)","v":0},{"$f":"IF(S17>0,J14,0)","v":0},null,null,"121",null,null,15,"03A3 Comp.",52,12,108,56,164,null,14,121,"121 (Hexagon w/Ex Leg)",{"$f":"IF(D130<18,D130,D133)","v":0},0,0,null,null,1,{"$f":"VLOOKUP(AQ17,AQ4:AU16,2,FALSE)","v":"Select"},{"$f":"VLOOKUP(EXTRUSION,EXTCHART,2,FALSE)","v":1},{"$f":"VLOOKUP(EXTRUSION,EXTCHART,3,FALSE)","v":0},{"$f":"VLOOKUP(EXTRUSION,EXTCHART,4,FALSE)","v":0},null,null,null,null,122,{"$f":"I139","v":0},{"$f":"I140","v":0},0,null,"Max. Long",0,{"$f":"IF(OR($BA$28>84,$BA$42>84),0,84)","v":84},{"$f":"IF(OR($BA$28>129,$BA$42>129),0,129)","v":129},{"$f":"IF(OR($BA$28>129,$BA$42>129),0,129)","v":129},"Tempered"]
[null,null,null,null,null,null,null,null,null,null,null,null,null,null,null,null,null,110,{"$f":"IF(AND(SHAPEW>0,SHAPEH>0,SHAPE=110),6,0)","v":0},{"$f":"IF(S18>0,\"Glass Width:\",0)","v":0},{"$f":"IF(S18>0,J11,0)","v":0},{"$f":"IF(AND(SHAPEW>0,SHAPEH>0,U18>0,U18<GlassMinW),1,0)","v":0},null,"122",null,null,16,"03A3 Steel",52,12,110,72,182,null,15,122,"122 (Octagon)",{"$f":"18","v":18},0,1,null,null,null,null,null,null,null,null,null,null,null,123,{"$f":"D154","v":0},{"$f":"D155","v":0},0,null,"Max Sq.Ft.",0,{"$f":"IF(OR($BC$28>24.5,$BC$42>24.5),0,24.5)","v":24.5},{"$f":"IF(OR($BC$28>42,$BC$42>42),0,42)","v":42},{"$f":"IF(OR($BC$28>42,$BC$42>42),0,42)","v":42},"Tempered"]
[null,null,null,null,null,null,null,null,null,null,null,null,null,null,null,null,null,110,{"$f":"IF(AND(SHAPEW>0,SHAPEH>0,SHAPE=110),7,0)","v":0},{"$f":"IF(S19>0,\"Glass Height:\",0)","v":0},{"$f":"IF(S19>0,J12,0)","v":0},{"$f":"IF(AND(SHAPEW>0,SHAPEH>0,U19>0,U19<GlassMinH),1,0)","v":0},null,"123",null,null,17,"03A4",9.5,9.5,112,112,154,null,16,123,"123 (Octagon w/Ex Leg)",{"$f":"IF(E155<18,E155,G154)","v":0},0,0,null,null,null,null,null,null,null,null,null,null,null,124,{"$f":"I163","v":0},{"$f":"I164","v":0},0,null,null,{"$f":"IF(AND(BF13>0,BF14>0,BF15>0),1,0)","v":1},{"$f":"IF(AND(BG13>0,BG14>0,BG15>0),1,0)","v":1},{"$f":"IF(AND(BH13>0,BH14>0,BH15>0),1,0)","v":1},{"$f":"IF(AND(BI13>0,BI14>0,BI15>0),1,0)","v":1},{"$f":"IF(BF19>0,\"≥SS Annealed\",IF(BG19>0,\"≥DS Annealed\",IF(BI19>0,\"TS Annealed\",\"\")))","v":"≥SS Annealed"}]
[null,111,"Min W","Max W","Max UI","Max Sq.ft",null,"Frame Height:",{"$f":"IF(AND(SHAPEW>0,SHAPE=B20),SHAPEW,0)","v":0},null,null,null,null,null,null,null,null,110,{"$f":"IF(AND(SHAPEW>0,SHAPEH>0,SHAPE=110),8,0)","v":0},{"$f":"IF(S20>0,\"Glass Leg Height:\",0)","v":0},{"$f":"IF(S20>0,J13,0)","v":0},null,null,"124",null,null,18,"03A9 Comp.",52,12,108,56,164,null,17,124,"124 (Pentagon Equilateral)",18,0,1,null,null,null,null,null,null,null,null,null,null,null,125,{"$f":"G176","v":0},{"$f":"G177","v":0},0,null,null,null,{"$f":"IF(AND(BG16>0,BG17>0,BG18>0),1,0)","v":1},{"$f":"IF(AND(BH16>0,BH17>0,BH18>0),1,0)","v":1},{"$f":"IF(AND(BI16>0,BI17>0,BI18>0),1,0)","v":1},{"$f":"IF(BG20>0,\"≥DS Tempered\",IF(BI20>0,\"TS Tempered\",\"\"))","v":"≥DS Tempered"}]
[null,{"$f":"EXT","v":1},{"$f":"MIN_W","v":""},{"$f":"MAX_W","v":""},{"$f":"MAX_UI","v":""},{"$f":"MAX_SF","v":""},null,"Frame R:",{"$f":"IF(AND(SHAPEW>0,SHAPE=B20),SHAPEW,0)","v":0},null,null,null,null,null,null,null,null,110,{"$f":"IF(AND(SHAPEW>0,SHAPEH>0,SHAPE=110),9,0)","v":0},{"$f":"IF(S21>0,\"Max Width:\",0)","v":0},{"$f":"IF(S21>0,D11,0)","v":0},{"$f":"IF(AND(S21>0,SHAPEW>0,SHAPEW>U21),1,0)","v":0},null,"125",null,null,19,"03A9 Steel",52,12,120,72,192,null,18,125,"125 (Half Pentagon)",{"$f":"IF(D173<18,D173,G174)","v":0},0,0,null,null,null,"Excalibur / I-Series",3180,1.75,1.75,null,null,null,null,126,{"$f":"G188","v":0},{"$f":"G185","v":0},0,null,"This is not being used"]
[null,null,{"$f":"IF(AND(SHAPEW>0,SHAPE=B20,SHAPEW<C21),1,0)","v":0},{"$f":"IF(AND(SHAPEW>0,OFFSET>0,SHAPE=B20,SHAPEW>D21),1,0)","v":0},{"$f":"IF(AND(SHAPEW>0,OFFSET>0,SHAPE=B20,(SHAPEW+I20)>E21),1,0)","v":0},{"$f":"IF(AND(SHAPEW>0,OFFSET>0,SHAPEH>0,SHAPE=B20,((SHAPEH*SHAPEW)/144)>F21),1,0)","v":0},null,"Glass R:",{"$f":"IF(AND(SHAPEW>0,SHAPE=B20),SHAPEW-OFFSET,0)","v":0},null,null,null,null,null,null,null,null,110,{"$f":"IF(AND(SHAPEW>0,SHAPEH>0,SHAPE=110),10,0)","v":0},{"$f":"IF(S22>0,\"Max Height:\",0)","v":0},{"$f":"IF(S22>0,F11,0)","v":0},{"$f":"IF(AND(S22>0,SHAPEH>0,SHAPEH>U22),1,0)","v":0},null,"126",null,null,20,"L201","11","20",48,78,126,null,19,126,"126 (Pentagon)",{"$f":"IF(D185<18,D185,G189)","v":0},0,0,null,null,null,null,null,null,null,null,null,null,null,127,{"$f":"D199","v":0},{"$f":"D200","v":0},0,null,{"$f":"IF(RADIUS>\"\",RADIUS,IF(SHAPEW>0,\"Available Glass Options: \"&GLASSOPT1&IF(AND(GLASSOPT1>\"\",GLASSOPT2>\"\"),\" Or \",\"\")&GLASSOPT2&\".\"&IF(EXTRUSION=\"0700\",\" TIG only in SS & DS. Dual IG in all Available Strengths.\",\" No TIG\"),\"\"))","v":""}]
[null,null,{"$f":"MAX(C22:F22)","v":0},{"$f":"IF(AND(SHAPE=B20,C23=1),1,0)","v":0},{"$f":"IF(AND(SHAPEW>0,SHAPE=111,SHAPEH>0,SHAPEH<>SHAPEW),1,0)","v":0},{"$f":"IF(AND(SHAPE=111,E23=1),\"HEIGHT MUST BE EQUAL TO THE WIDTH\",IF(AND(SHAPE=111,SHAPEW>0,C22>0),\"RADIUS MUST BE GREATER THAN \"&C21,IF(AND(SHAPE=111,I23>0,I23<GlassMinW),\"Glass Width or Height is Under Minimum\",\"\")))","v":""},null,"Glass W & H:",{"$f":"IF(AND(SHAPEW>0,OFFSET>0,SHAPE=B20),SHAPEW-(OFFSET*2)-I26,0)","v":0},null,null,null,null,null,null,null,null,110,{"$f":"IF(AND(SHAPEW>0,SHAPEH>0,SHAPE=110),11,0)","v":0},{"$f":"IF(S23>0,\"Max UI:\",0)","v":0},{"$f":"IF(S23>0,E11,0)","v":0},{"$f":"IF(AND(S23>0,E12>0),1,0)","v":0},null,"127",null,null,21,"L202","18","9","84",56,140,null,20,127,"127 (Cathedral)",18,0,0,null,null,null,"Glass Min. Max.",null,null,null,null,null,null,null,128,{"$f":"D210","v":0},{"$f":"D211","v":0},0]
[null,null,null,null,null,null,null,"F",{"$f":"IF(AND(SHAPEW>0,OFFSET>0,SHAPE=B20),2*(ASIN((OFFSET*2)/(2*I22))),0)","v":0},null,null,null,null,null,null,null,null,111,{"$f":"IF(AND(SHAPEW>0,SHAPE=111),1,0)","v":0},{"$f":"IF(S24>0,\"Frame Width:\",0)","v":0},{"$f":"IF(S24>0,SHAPEW,0)","v":0},null,null,"128",null,null,22,"L203",48,"9",108,56,164,null,21,128,"128 (Cathedral w/Ex Leg)",18,0,0,null,null,null,"Glass Min Width",6,null,null,null,null,null,null,129,{"$f":"G221","v":0},{"$f":"G222","v":0},0]
[null,null,null,null,null,null,null,"d",{"$f":"IF(AND(SHAPEW>0,SHAPE=B20),I22*COS(I24/2),0)","v":0},null,null,null,null,null,null,null,null,111,{"$f":"IF(AND(SHAPEW>0,SHAPE=111),2,0)","v":0},{"$f":"IF(S25>0,\"Frame Height:\",0)","v":0},{"$f":"IF(S25>0,I20,0)","v":0},null,null,"129",null,null,23,"L204",12,"9",96,"96","154",null,22,129,"129 (Trapezoid)",{"$f":"IF(D221<18,D221,G224)","v":0},0,0,null,null,null,"Glass Min Height",6,null,null,null,null,null,null,130,{"$f":"D236","v":0},{"$f":"G233","v":0},0]
[null,null,null,null,null,null,null,"h",{"$f":"I22-I25","v":0},null,null,null,null,null,null,null,null,111,{"$f":"IF(AND(SHAPEW>0,SHAPE=111),3,0)","v":0},{"$f":"IF(S26>0,\"Frame Radius:\",0)","v":0},{"$f":"IF(S26>0,I21,0)","v":0},{"$f":"IF(AND(S26>0,C22>0),1,0)","v":0},null,"130",null,null,24,"L209",38,"9",108,56,164,null,23,130,"130 (Right Triangle)",{"$f":"IF(G235<18,G235,G236)","v":0},0,0,null,null,null,null,null,null,null,null,null,null,null,131,{"$f":"D246","v":0},{"$f":"G244","v":0},0]
[null,null,null,null,null,null,null,null,null,null,null,null,null,null,null,null,null,111,{"$f":"IF(AND(SHAPEW>0,SHAPE=111),4,0)","v":0},{"$f":"IF(S27>0,\"Glass Radius:\",0)","v":0},{"$f":"IF(S27>0,I22,0)","v":0},null,null,"131",null,null,25,"0501","15.25","26.75","52","84","136",null,24,131,"131 (Equilateral Triangle)",30,0,1,null,null,null,"Minimum Radius",null,null,"S140","S144","S146",null,null,132,{"$f":"D255","v":0},{"$f":"D256","v":0},0]
[null,null,null,null,null,null,null,null,null,null,null,null,null,null,null,null,null,111,{"$f":"IF(AND(SHAPEW>0,SHAPE=111),5,0)","v":0},{"$f":"IF(S28>0,\"Glass Width:\",0)","v":0},{"$f":"IF(S28>0,I23,0)","v":0},{"$f":"IF(AND(U28>0,U28<GlassMinW),1,0)","v":0},null,"132",null,null,26,"0502","25.25","16.625","84","68","148",null,25,132,"132 (Isosceles Triangle)",{"$f":"IF(G253<18,G253,G254)","v":0},0,0,null,null,null,"SH2201",10,"8V",{"$f":"SH_2201*2","v":20},18.375,14.375,null,null,{"$f":"SHAPE","v":"Select"},{"$f":"IF(AND(SHAPELINK>1,SHAPEW>0),VLOOKUP(SHAPE,GLASSCHART,2,FALSE),0)","v":0},{"$f":"IF(AND(SHAPELINK>1,SHAPEW>0),VLOOKUP(SHAPE,GLASSCHART,3,FALSE),0)","v":0},{"$f":"IF(AND(SHAPELINK>1,SHAPEW>0),VLOOKUP(SHAPE,GLASSCHART,4,FALSE),0)","v":0}]
[null,112,"Min W","Max W","Max UI","Max H","Min Leg",null,"Frame Height:",{"$f":"IF(AND(SHAPEW>0,SHAPE=B29,SHAPEH>0),SHAPEH,0)","v":0},null,null,null,null,null,null,null,111,{"$f":"IF(AND(SHAPEW>0,SHAPE=111),6,0)","v":0},{"$f":"IF(S29>0,\"Glass Height:\",0)","v":0},{"$f":"IF(S29>0,I23,0)","v":0},{"$f":"IF(AND(U29>0,U29<GlassMinH),1,0)","v":0},null,null,null,null,27,"0503","44.5","16.625","120","68",188,null,1,{"$f":"VLOOKUP($AI$29,SHAPECHART,2,FALSE)","v":"Select"},{"$f":"VLOOKUP($AI$29,SHAPECHART,3,FALSE)","v":"Select"},{"$f":"IF(OR(SHAPE=121,SHAPE=123,SHAPE=125,SHAPE=126,SHAPE=129),1,0)","v":0},{"$f":"IF(OR(SHAPE=114,SHAPE=116,SHAPE=125,SHAPE=128),1,0)","v":0},{"$f":"VLOOKUP(SHAPELINK,AI4:AM28,5,FALSE)","v":1},{"$f":"VLOOKUP(SHAPELINK,AI4:AN28,6,FALSE)","v":1},null,null,"PWFO1",10,"6J","N/A","N/A","N/A",null,null,"Glass Options"]
[null,{"$f":"EXT","v":1},{"$f":"MIN_W","v":""},{"$f":"MAX_W","v":""},{"$f":"MAX_UI","v":""},{"$f":"MAX_H","v":""},6.25E-2,null,"Frame R:",{"$f":"IF(AND(SHAPEW>0,SHAPE=B29),SHAPEW,0)","v":0},null,null,null,null,null,null,null,111,{"$f":"IF(AND(SHAPEW>0,SHAPE=111),7,0)","v":0},{"$f":"IF(S30>0,\"Max Width:\",0)","v":0},{"$f":"IF(S30>0,D21,0)","v":0},{"$f":"IF(AND(S30>0,SHAPEW>0,SHAPEW>U30),1,0)","v":0},null,null,null,null,28,"0504","13","13","96",96,"154",null,null,null,null,"DIM3","DIM4","Width","Height",null,null,"PW3001",11.75,"8X","N/A","N/A","N/A",null,null,{"$f":"IF(BJ10>\"\",BJ10,IF(BJ19>\"\",BJ19,\"\"))","v":"≥SS Annealed"},null,{"$f":"IF(OR(BJ10=\"≥SS Annealed\",BJ10=\"≥DS Annealed\",BJ11=\"≥DS Tempered\",BJ19=\"≥SS Annealed\",BJ19=\"≥DS Annealed\",BJ20=\"≥DS Tempered\",EXTRUSION=\"0700\"),\"TIG\",\"\")","v":"TIG"},{"$f":"IF(OR(AND(GLASS_W>70,GLASS_H>102),AND(GLASS_W>102,GLASS_H>70),GLASS_SQFT>35),1,IF(OR(AND(GLASS_W>70,GLASS_H>129),AND(GLASS_W>129,GLASS_H>70),GLASS_SQFT>42),2,0))","v":0}]
[null,null,{"$f":"IF(AND(SHAPEW>0,SHAPE=B29,SHAPEW<C30),1,0)","v":0},{"$f":"IF(AND(SHAPEW>0,OFFSET>0,SHAPE=B29,SHAPEW>D30),1,0)","v":0},{"$f":"IF(AND(SHAPEW>0,OFFSET>0,SHAPE=B29,(SHAPEW+SHAPEH)>E30),1,0)","v":0},{"$f":"IF(AND(SHAPEW>0,OFFSET>0,SHAPE=B29,SHAPEH>F30),1,0)","v":0},{"$f":"IF(AND(SHAPEW>0,SHAPE=B29,(SHAPEH-SHAPEW)<G30),1,0)","v":0},null,"Glass R:",{"$f":"IF(AND(SHAPEW>0,SHAPE=B29),SHAPEW-OFFSET,0)","v":0},null,null,null,null,null,null,null,111,{"$f":"IF(AND(SHAPEW>0,SHAPE=111),8,0)","v":0},{"$f":"IF(S31>0,\"Max UI:\",0)","v":0},{"$f":"IF(S31>0,E21,0)","v":0},{"$f":"IF(AND(S31>0,E22>0),1,0)","v":0},null,null,null,null,29,"0509","35.5","16.625",112,"68","184",null,null,null,null,null,null,null,null,null,null,3180,11.75,"6K",{"$f":"EXCAL*2","v":23.5},19.625,11,null,null,{"$f":"IF(BJ11>\"\",BJ11,IF(BJ20>\"\",BJ20,\"\"))","v":"≥DS Tempered"},null,{"$f":"IF(AND(GLASS=\"\",GLASSOPT1>\"\"),GLASSOPT1&IF(GLASSOPT2>\"\",\" OR \"&GLASSOPT2,\"\"))","v":false}]
[null,null,{"$f":"MAX(C31:G31)","v":0},{"$f":"IF(AND(SHAPE=B29,C32=1),1,0)","v":0},{"$f":"IF(AND(SHAPEW>0,SHAPEH>0,DIM_4>0,SHAPE=112,SHAPEH<>(SHAPEW+DIM_4)),1,0)","v":0},{"$f":"IF(AND(SHAPE=112,E32=1),\"HEIGHT MUST BE EQUAL TO THE WIDTH + DIM4\",IF(AND(SHAPE=112,SHAPEW>0,C31>0),\"RADIUS MUST BE GREATER THAN \"&C30,IF(AND(SHAPE=112,J32>0,J32<GlassMinW),\"Glass Width is Under Minimum\",IF(AND(SHAPE=112,J33>0,J33<GlassMinH),\"Glass Height is Under Minimum\",\"\"))))","v":""},null,null,"Glass W:",{"$f":"IF(AND(SHAPEW>0,OFFSET>0,SHAPE=B29),SHAPEW-(OFFSET*2),0)","v":0},null,null,null,null,null,null,null,112,{"$f":"IF(AND(SHAPEW>0,SHAPEH>0,SHAPE=112),1,0)","v":0},{"$f":"IF(S32>0,\"Frame Width:\",0)","v":0},{"$f":"IF(S32>0,SHAPEW,0)","v":0},null,null,null,null,null,30,"0601","15.25","25.875","52",84,"136",null,null,null,null,null,null,null,null,null,null,5336,12.5,"8Y","N/A","N/A","N/A"]
[null,null,null,null,null,null,null,null,"Glass H:",{"$f":"IF(AND(SHAPEW>0,OFFSET>0,SHAPE=B29,SHAPEH>0),SHAPEH-(OFFSET*2)-J37,0)","v":0},null,null,null,null,null,null,null,112,{"$f":"IF(AND(SHAPEW>0,SHAPEH>0,SHAPE=112),2,0)","v":0},{"$f":"IF(S33>0,\"Frame Height:\",0)","v":0},{"$f":"IF(S33>0,J29,0)","v":0},null,null,null,null,null,31,"0602","25.25","16.625","84","68","148",null,null,null,null,null,null,null,null,null,null,"PI2101",13.75,"6V","N/A","N/A","N/A",null,null,"Model","Width","Height","Area"]
[null,null,null,null,null,null,null,null,"Glass Leg H:",{"$f":"IF(AND(SHAPEW>0,SHAPEH>0,SHAPE=B29,OFFSET>0),(SHAPEH-SHAPEW)-OFFSET,0)","v":0},null,null,null,null,null,null,null,112,{"$f":"IF(AND(SHAPEW>0,SHAPEH>0,SHAPE=112),3,0)","v":0},{"$f":"IF(S34>0,\"Frame Radius:\",0)","v":0},{"$f":"IF(S34>0,J30,0)","v":0},{"$f":"IF(AND(S34>0,C31>0),1,0)","v":0},null,null,null,null,32,"0603","44.5","16.625","120","68",188,null,null,null,null,null,null,null,null,null,null,"SH46",{"$f":"IF(OR(SHAPE=117,SHAPE=119),13,12.5)","v":12.5},null,{"$f":"IF(ISERROR(VLOOKUP(EXT,$AR$28:$AW$33,4,FALSE)),\"N/A\",VLOOKUP(EXT,$AR$28:$AW$33,4,FALSE))","v":"N/A"},{"$f":"IF(ISERROR(VLOOKUP(EXT,$AR$28:$AW$33,5,FALSE)),\"N/A\",VLOOKUP(EXT,$AR$28:$AW$33,5,FALSE))","v":"N/A"},{"$f":"IF(ISERROR(VLOOKUP(EXT,$AR$28:$AW$33,6,FALSE)),\"N/A\",VLOOKUP(EXT,$AR$28:$AW$33,6,FALSE))","v":"N/A"},null,1,"Select"]
[null,null,null,null,null,null,null,null,"F",{"$f":"IF(AND(SHAPEW>0,OFFSET>0,SHAPE=B29),2*(ASIN((OFFSET*2)/(2*J31))),0)","v":0},null,null,null,null,null,null,null,112,{"$f":"IF(AND(SHAPEW>0,SHAPEH>0,SHAPE=112),4,0)","v":0},{"$f":"IF(S35>0,\"Frame Leg:\",0)","v":0},{"$f":"IF(AND(S35>0,SHAPEH>0,SHAPEW>0),SHAPEH-SHAPEW,0)","v":0},{"$f":"IF(AND(S35>0,G31>0),1,0)","v":0},null,null,null,null,33,"0605","14","14","72","60","118",null,null,null,null,null,null,null,null,null,null,"SH5702",12.5,null,null,null,null,null,2,"0504",{"$f":"IF(AND(SHAPEW>0,SHAPEH>0),SHAPEW-4.625,0)","v":0},{"$f":"IF(AND(SHAPEW>0,SHAPEH>0),SHAPEH-4.625,0)","v":0},{"$f":"(BA35*BB35)/144","v":0}]
[null,null,null,null,null,null,null,null,"d",{"$f":"IF(AND(SHAPEW>0,SHAPE=B29),J31*COS(J35/2),0)","v":0},null,null,null,null,null,null,null,112,{"$f":"IF(AND(SHAPEW>0,SHAPEH>0,SHAPE=112),5,0)","v":0},{"$f":"IF(S36>0,\"Glass Radius:\",0)","v":0},{"$f":"IF(S36>0,J31,0)","v":0},null,null,null,null,null,34,"0609","35.5","16.625",112,"68","184",null,null,null,null,null,null,null,null,null,null,"Pi5801",12.5,null,null,null,null,null,3,"0614",0,0,0]
[null,null,null,null,null,null,null,null,"h",{"$f":"J31-J36","v":0},null,null,null,null,null,null,null,112,{"$f":"IF(AND(SHAPEW>0,SHAPEH>0,SHAPE=112),6,0)","v":0},{"$f":"IF(S37>0,\"Glass Width:\",0)","v":0},{"$f":"IF(S37>0,J32,0)","v":0},{"$f":"IF(AND(U37>0,U37<GlassMinW),1,0)","v":0},null,null,null,null,35,"0614","13","13","96",96,"154",null,null,null,null,null,null,null,null,null,null,"V-Series",12.5,null,null,null,null,null,4,"0970",0,0,0]
[null,null,null,null,null,null,null,null,null,null,null,null,null,null,null,null,null,112,{"$f":"IF(AND(SHAPEW>0,SHAPEH>0,SHAPE=112),7,0)","v":0},{"$f":"IF(S38>0,\"Glass Height:\",0)","v":0},{"$f":"IF(S38>0,J33,0)","v":0},{"$f":"IF(AND(U38>0,U38<GlassMinH),1,0)","v":0},null,null,null,null,36,"0700","14.375","23.75","52",72,120,null,null,null,null,null,null,null,null,null,null,"Pi7301",12.5,null,null,null,null,null,5,"8014",0,0,0]
[null,null,null,null,null,null,null,null,null,null,null,null,null,null,null,null,null,112,{"$f":"IF(AND(SHAPEW>0,SHAPEH>0,SHAPE=112),8,0)","v":0},{"$f":"IF(S39>0,\"Glass Leg Height:\",0)","v":0},{"$f":"IF(S39>0,J34,0)","v":0},null,null,null,null,null,37,"0701","14.375","35.5","52","108","156",null,null,null,null,null,null,null,null,null,null,3954,12.5,null,null,null,null,null,6,"8070",0,0,0]
[null,113,"Min R","Max W","Max UI","Max Sq.ft","Cut L","Min H","Frame Radius",{"$f":"IF(AND(SHAPEW>0,SHAPEH>0,SHAPE=B40),((SHAPEW/2)^2+SHAPEH^2)/(2*SHAPEH),0)","v":0},null,null,null,null,null,null,null,112,{"$f":"IF(AND(SHAPEW>0,SHAPEH>0,SHAPE=112),9,0)","v":0},{"$f":"IF(S40>0,\"Max Width:\",0)","v":0},{"$f":"IF(S40>0,D30,0)","v":0},{"$f":"IF(AND(S40>0,SHAPEW>0,SHAPEW>U40),1,0)","v":0},null,null,null,null,38,"0702","23.5","14.25","72","60","132",null,null,null,null,null,null,null,null,null,null,"3954F",{"$f":"IF(OR(SHAPE=117,SHAPE=119),13.5,13)","v":13},null,null,null,null,null,7,"9014",0,0,0]
[null,{"$f":"EXT","v":1},{"$f":"MIN_R","v":""},{"$f":"MAX_W","v":""},{"$f":"MAX_UI","v":""},{"$f":"MAX_SF","v":""},{"$f":"CUT_LENGTH","v":""},{"$f":"MIN_H","v":""},"Glass Radius",{"$f":"IF(AND(SHAPEW>0,SHAPEH>0,OFFSET>0,SHAPE=B40),J40-OFFSET,0)","v":0},{"$f":"IF(AND(SHAPEW>0,SHAPEH>0,OFFSET>0,SHAPE=B40),J40-CUTOFFSET,0)","v":0},null,null,null,null,null,null,112,{"$f":"IF(AND(SHAPEW>0,SHAPEH>0,SHAPE=112),10,0)","v":0},{"$f":"IF(S41>0,\"Max Height:\",0)","v":0},{"$f":"IF(S41>0,F30,0)","v":0},{"$f":"IF(AND(S41>0,SHAPEH>0,SHAPEH>U41),1,0)","v":0},null,null,null,null,39,"0703","48","14.25","108","60","168",null,null,null,null,null,null,null,null,null,null,null,null,null,null,null,null,null,8,"9070",0,0,0]
[null,null,{"$f":"IF(AND(SHAPEW>0,SHAPEH>0,SHAPE=B40,J40<C41),1,0)","v":0},{"$f":"IF(AND(SHAPEW>0,OFFSET>0,SHAPE=B40,SHAPEW>D41),1,0)","v":0},{"$f":"IF(AND(SHAPEW>0,OFFSET>0,SHAPEH>0,SHAPE=B40,(SHAPEW+SHAPEH)>E41),1,0)","v":0},{"$f":"IF(AND(SHAPEW>0,OFFSET>0,SHAPEH>0,SHAPE=B40,((SHAPEW*SHAPEH)/144)>F41),1,0)","v":0},{"$f":"IF(AND(SHAPEW>0,SHAPE=B40,SHAPEH>0,J45>G41),1,0)","v":0},{"$f":"IF(AND(SHAPEW>0,SHAPEH>0,SHAPE=113,SHAPEH<H41),1,0)","v":0},"Glass Height",{"$f":"IF(AND(SHAPEW>0,SHAPEH>0,OFFSET>0,SHAPE=B40),SHAPEH-(2*OFFSET),0)","v":0},{"$f":"IF(AND(SHAPEW>0,SHAPEH>0,OFFSET>0,SHAPE=B40),SHAPEH-(2*CUTOFFSET),0)","v":0},null,null,null,null,null,null,112,{"$f":"IF(AND(SHAPEW>0,SHAPEH>0,SHAPE=112),11,0)","v":0},{"$f":"IF(S42>0,\"Max UI:\",0)","v":0},{"$f":"IF(S42>0,E30,0)","v":0},{"$f":"IF(AND(S42>0,E31>0),1,0)","v":0},null,null,null,null,40,"0704","12","12",96,96,"154",null,null,null,null,null,null,null,null,null,null,null,null,null,null,null,null,null,1,{"$f":"IF(AND(PWSELECT>1,SHAPEW>0,SHAPEH>0),VLOOKUP(PWSELECT,PWTABLE,2,FALSE),0)","v":0},{"$f":"IF(AND(PWSELECT>1,SHAPEW>0,SHAPEH>0),VLOOKUP(PWSELECT,PWTABLE,3,FALSE),0)","v":0},{"$f":"IF(AND(PWSELECT>1,SHAPEW>0,SHAPEH>0),VLOOKUP(PWSELECT,PWTABLE,4,FALSE),0)","v":0},{"$f":"IF(AND(PWSELECT>1,SHAPEW>0,SHAPEH>0),VLOOKUP(PWSELECT,PWTABLE,5,FALSE),0)","v":0}]
[null,null,{"$f":"MAX(C42:H42)","v":0},{"$f":"IF(AND(SHAPE=B40,C43=1),1,0)","v":0},{"$f":"IF(AND(SHAPEW>0,SHAPEH>0,SHAPE=113,SHAPEH>=(SHAPEW/2)),1,0)","v":0},{"$f":"IF(AND(SHAPE=113,E43=1),\"FRAME HEIGHT MUST BE LESS THAN 1/2 THE WIDTH\",IF(AND(SHAPE=113,SHAPEW>0,C42>0),\"RADIUS MUST BE GREATER THAN \"&C41,IF(AND(SHAPE=113,J43>0,J43<GlassMinW),\"Glass Width is Under Minimum\",IF(AND(SHAPE=113,J42>0,J42<GlassMinH),\"Glass Height is Under Minimum\",\"\"))))","v":""},null,null,"Glass Width",{"$f":"IF(AND(SHAPEW>0,SHAPEH>0,OFFSET>0,SHAPE=B40),2*(SQRT(J42*((2*J41)-J42))),0)","v":0},{"$f":"IF(AND(SHAPEW>0,SHAPEH>0,OFFSET>0,SHAPE=B40),2*(SQRT(K42*((2*K41)-K42))),0)","v":0},null,null,null,null,null,null,113,{"$f":"IF(AND(SHAPEW>0,SHAPEH>0,SHAPE=113),1,0)","v":0},{"$f":"IF(S43>0,\"Frame Radius:\",0)","v":0},{"$f":"IF(S43>0,J40,0)","v":0},{"$f":"IF(AND(S43>0,C42>0),1,0)","v":0},null,null,null,null,41,"0709","34.75","14.25","108","60","168"]
[null,null,null,null,null,null,null,null,"Angle of cut",{"$f":"IF(AND(SHAPEW>0,SHAPEH>0,OFFSET>0,SHAPE=B40),DEGREES(ATAN(CUTOFFSET/((SHAPEW-K43)/2))),0)","v":0},null,null,null,null,null,null,null,113,{"$f":"IF(AND(SHAPEW>0,SHAPEH>0,SHAPE=113),2,0)","v":0},{"$f":"IF(S44>0,\"Glass Radius:\",0)","v":0},{"$f":"IF(S44>0,J41,0)","v":0},null,null,null,null,null,42,"07HP","14.375","23.75","52","77","129"]
[null,null,null,null,null,null,null,null,"Cut Length",{"$f":"IF(AND(SHAPEW>0,SHAPEH>0,OFFSET>0,SHAPE=B40),SQRT(CUTOFFSET^2+((SHAPEW-K43)/2)^2),0)","v":0},null,null,null,null,null,null,null,113,{"$f":"IF(AND(SHAPEW>0,SHAPEH>0,SHAPE=113),3,0)","v":0},{"$f":"IF(S45>0,\"Glass Width:\",0)","v":0},{"$f":"IF(S45>0,J43,0)","v":0},{"$f":"IF(AND(U45>0,U45<GlassMinW),1,0)","v":0},null,null,null,null,43,"09C7",12,12,36,36,55]
[null,null,null,null,null,null,null,null,"Arc Length:",{"$f":"IF(AND(SHAPEW>0,SHAPEH>0,OFFSET>0,SHAPE=B40),J40*(2*(ASIN(SHAPEW/(2*J40)))),0)","v":0},null,null,null,null,null,null,null,113,{"$f":"IF(AND(SHAPEW>0,SHAPEH>0,SHAPE=113),4,0)","v":0},{"$f":"IF(S46>0,\"Glass Height:\",0)","v":0},{"$f":"IF(S46>0,J42,0)","v":0},{"$f":"IF(AND(U46>0,U46<GlassMinH),1,0)","v":0},null,null,null,null,44,"0951","19","16","48","48","96"]
[null,null,null,null,null,null,null,null,null,null,null,null,null,null,null,null,null,113,{"$f":"IF(AND(SHAPEW>0,SHAPEH>0,SHAPE=113),5,0)","v":0},{"$f":"IF(S47>0,\"Angle of Cut:\",0)","v":0},{"$f":"IF(S47>0,J44,0)","v":0},null,null,null,null,null,45,"0952","19","32","48","96","144"]
[null,114,"Min R","Max W","Max H","Max UI","Min Leg","Cut L","Frame Radius",{"$f":"IF(AND(SHAPEW>0,SHAPEH>0,DIM_4>0,SHAPE=B48),((SHAPEW/2)^2+(SHAPEH-DIM_4)^2)/(2*(SHAPEH-DIM_4)),0)","v":0},null,null,null,null,null,null,null,113,{"$f":"IF(AND(SHAPEW>0,SHAPEH>0,SHAPE=113),6,0)","v":0},{"$f":"IF(S48>0,\"Cut Length:\",0)","v":0},{"$f":"IF(S48>0,J45,0)","v":0},{"$f":"IF(AND(S48>0,G42>0),1,0)","v":0},null,null,null,null,46,"0953","19","48","48","96","144"]
[null,{"$f":"EXT","v":1},{"$f":"MIN_R","v":""},{"$f":"MAX_W","v":""},{"$f":"MAX_H","v":""},{"$f":"MAX_UI","v":""},{"$f":"MIN_LEG","v":""},{"$f":"CUT_LENGTH","v":""},"Glass Radius",{"$f":"IF(AND(SHAPEW>0,SHAPEH>0,DIM_4>0,OFFSET>0,SHAPE=B48),J48-OFFSET,0)","v":0},{"$f":"IF(AND(SHAPEW>0,SHAPEH>0,DIM_4>0,OFFSET>0,SHAPE=B48),J48-CUTOFFSET,0)","v":0},null,null,null,null,null,null,113,{"$f":"IF(AND(SHAPEW>0,SHAPEH>0,SHAPE=113),7,0)","v":0},{"$f":"IF(S48>0,\"Min. Height:\",0)","v":0},{"$f":"IF(S49>0,H41,0)","v":0},{"$f":"IF(AND(S49>0,SHAPEH>0,SHAPEH<U49),1,0)","v":0},null,null,null,null,47,"0954","19","32","48","96","144"]
[null,null,{"$f":"IF(AND(SHAPEW>0,SHAPEH>0,SHAPE=B48,J48<C49),1,0)","v":0},{"$f":"IF(AND(SHAPEW>0,OFFSET>0,SHAPEH>0,SHAPE=B48,OR(SHAPEW>D49,SHAPEH>D49)),1,0)","v":0},{"$f":"IF(AND(SHAPEW>0,OFFSET>0,SHAPEH>0,SHAPE=B48,SHAPEH>E49),1,0)","v":0},{"$f":"IF(AND(SHAPEW>0,OFFSET>0,SHAPEH>0,SHAPE=B48,DIM_4>0,(SHAPEW+SHAPEH)>F49),1,0)","v":0},{"$f":"IF(AND(SHAPEW>0,SHAPEH>0,SHAPE=B48,DIM_4>0,DIM_4<G49),1,0)","v":0},{"$f":"IF(AND(SHAPEW>0,SHAPE=B48,SHAPEH>0,OR(J53>H49,J54>H49)),1,0)","v":0},"Glass Height",{"$f":"IF(AND(SHAPEW>0,SHAPEH>0,DIM_4>0,OFFSET>0,SHAPE=B48),SHAPEH-(2*OFFSET),0)","v":0},{"$f":"IF(AND(SHAPEW>0,SHAPEH>0,DIM_4>0,OFFSET>0,SHAPE=B48),SHAPEH-(2*CUTOFFSET),0)","v":0},null,null,null,null,null,null,113,{"$f":"IF(AND(SHAPEW>0,SHAPEH>0,SHAPE=113),8,0)","v":0},{"$f":"IF(S50>0,\"Max Width:\",0)","v":0},{"$f":"IF(S50>0,D41,0)","v":0},{"$f":"IF(AND(S50>0,SHAPEW>0,SHAPEW>U50),1,0)","v":0},null,null,null,null,48,"0955","19","32","48","96","144"]
[null,null,{"$f":"MAX(C50:H50)","v":0},{"$f":"IF(AND(SHAPE=B48,C51=1),1,0)","v":0},null,{"$f":"IF(AND(SHAPEW>0,SHAPEH>0,SHAPE=B48,(SHAPEH-DIM_4)>=(SHAPEW/2)),1,0)","v":0},{"$f":"IF(AND(SHAPE=114,F51=1),\"FRAME HEIGHT MINUS LEG MUST BE LESS THAN 1/2 THE WIDTH\",IF(AND(SHAPE=114,SHAPEW>0,C50>0),\"RADIUS MUST BE GREATER THAN \"&C49,IF(AND(SHAPE=114,J51>0,J51<GlassMinW),\"Glass Width is Under Minimum\",IF(AND(SHAPE=114,J50>0,J50<GlassMinH),\"Glass Height is Under Minimum\",\"\"))))","v":""},null,"Glass Width",{"$f":"IF(AND(SHAPEW>0,SHAPEH>0,DIM_4>0,OFFSET>0,SHAPE=B48),SHAPEW-(2*OFFSET),0)","v":0},{"$f":"IF(AND(SHAPEW>0,SHAPEH>0,DIM_4>0,OFFSET>0,SHAPE=B48),SHAPEW-(2*CUTOFFSET),0)","v":0},null,null,null,null,null,null,113,{"$f":"IF(AND(SHAPEW>0,SHAPEH>0,SHAPE=113),9,0)","v":0},{"$f":"IF(S51>0,\"Max UI:\",0)","v":0},{"$f":"IF(S51>0,E41,0)","v":0},{"$f":"IF(AND(S51>0,E42>0),1,0)","v":0},null,null,null,null,49,"0970","13","13","96",96,"154"]
[null,null,null,null,null,null,null,null,"Glass Leg Height",{"$f":"IF(AND(SHAPEW>0,OFFSET>0,DIM_4>0,SHAPE=114),DIM_4-(OFFSET+((J48*COS((2*(ASIN(SHAPEW/(2*J48))))/2))-(J49*COS((2*(ASIN((SHAPEW-(2*OFFSET))/(2*J49))))/2)))),0)","v":0},{"$f":"IF(AND(SHAPEW>0,OFFSET>0,DIM_4>0,SHAPE=114),DIM_4-(CUTOFFSET+((J48*COS((2*(ASIN(SHAPEW/(2*J48))))/2))-(K49*COS((2*(ASIN((SHAPEW-(2*CUTOFFSET))/(2*K49))))/2)))),0)","v":0},null,null,null,null,null,null,113,{"$f":"IF(AND(SHAPEW>0,SHAPEH>0,SHAPE=113),10,0)","v":0},{"$f":"IF(S52>0,\"Arc Length:\",0)","v":0},{"$f":"IF(S52>0,J46,0)","v":0},{"$f":"IF(AND(S52>0,J46>157),1,0)","v":0},null,null,null,null,50,"0971","16","19","36","78","114"]
[null,null,null,null,null,null,null,null,"Cut L @ Sill & Vert",{"$f":"IF(AND(SHAPEW>0,SHAPEH>0,DIM_4>0,OFFSET>0,SHAPE=114),SQRT(CUTOFFSET^2+((SHAPEW-K51)/2)^2),0)","v":0},{"$f":"IF(AND(SHAPEW>0,SHAPEH>0,DIM_4>0,OFFSET>0,SHAPE=114),SQRT(CUTOFFSET^2+((SHAPEW-K51)/2)^2),0)","v":0},null,null,null,null,null,null,114,{"$f":"IF(AND(SHAPEW>0,SHAPEH>0,DIM_4>0,SHAPE=114),1,0)","v":0},{"$f":"IF(S53>0,\"Frame Radius:\",0)","v":0},{"$f":"IF(S53>0,J48,0)","v":0},{"$f":"IF(AND(S53>0,C50>0),1,0)","v":0},null,null,null,null,51,"0972","32","19","72","78","150"]
[null,null,null,null,null,null,null,null,"Cut L @ Leg & Arc:",{"$f":"IF(AND(SHAPEW>0,SHAPEH>0,DIM_4>0,OFFSET>0,SHAPE=114),SQRT(CUTOFFSET^2+((DIM_4-CUTOFFSET)-K52)^2),0)","v":0},null,null,null,null,null,null,null,114,{"$f":"IF(AND(SHAPEW>0,SHAPEH>0,DIM_4>0,SHAPE=114),2,0)","v":0},{"$f":"IF(S54>0,\"Frame Leg:\",0)","v":0},{"$f":"IF(S54>0,DIM_4,0)","v":0},{"$f":"IF(AND(S54>0,G50>0),1,0)","v":0},null,null,null,null,52,"0973","64","19","120","78","198"]
[null,null,null,null,null,null,null,null,"Angle of Cut @ Leg & Arc:",{"$f":"IF(AND(SHAPEW>0,SHAPEH>0,DIM_4>0,OFFSET>0,SHAPE=114),DEGREES(ACOS(CUTOFFSET/J54)),0)","v":0},null,null,null,null,null,null,null,114,{"$f":"IF(AND(SHAPEW>0,SHAPEH>0,DIM_4>0,SHAPE=114),3,0)","v":0},{"$f":"IF(S55>0,\"Glass Radius:\",0)","v":0},{"$f":"IF(S55>0,J49,0)","v":0},null,null,null,null,null,53,"0974","64","19","120","78","198"]
[null,null,null,null,null,null,null,null,"Arc Length:",{"$f":"IF(AND(SHAPEW>0,SHAPEH>0,DIM_4>0,OFFSET>0,SHAPE=114),J48*(2*(ASIN(SHAPEW/(2*J48)))),0)","v":0},null,null,null,null,null,null,null,114,{"$f":"IF(AND(SHAPEW>0,SHAPEH>0,DIM_4>0,SHAPE=114),4,0)","v":0},{"$f":"IF(S56>0,\"Glass Width:\",0)","v":0},{"$f":"IF(S56>0,J51,0)","v":0},{"$f":"IF(AND(U56>0,U56<GlassMinW),1,0)","v":0},null,null,null,null,54,"0975","80","19","120","78","198"]
[null,null,null,null,null,null,null,null,null,null,null,null,null,null,null,null,null,114,{"$f":"IF(AND(SHAPEW>0,SHAPEH>0,DIM_4>0,SHAPE=114),5,0)","v":0},{"$f":"IF(S57>0,\"Glass Height:\",0)","v":0},{"$f":"IF(S57>0,J50,0)","v":0},{"$f":"IF(AND(U57>0,U57<GlassMinH),1,0)","v":0},null,null,null,null,55,"0979","48","19","108","78","186"]
[null,115,"Min R","Max W","Min Leg","Max UI","Cut L","Max H","Min H",null,null,null,null,null,null,null,null,114,{"$f":"IF(AND(SHAPEW>0,SHAPEH>0,DIM_4>0,SHAPE=114),6,0)","v":0},{"$f":"IF(S58>0,\"Glass Leg:\",0)","v":0},{"$f":"IF(S58>0,J52,0)","v":0},null,null,null,null,null,56,1700,14.25,25,52,96,144,"Width > 48, Height Must be < 84 - Heights > 84 Must be Oriel"]
[null,{"$f":"EXT","v":1},{"$f":"MIN_R","v":""},{"$f":"MAX_W","v":""},{"$f":"MIN_LEG","v":""},{"$f":"MAX_UI","v":""},{"$f":"CUT_LENGTH","v":""},{"$f":"MAX_H","v":""},{"$f":"MIN_H1","v":""},null,null,null,null,null,null,null,null,114,{"$f":"IF(AND(SHAPEW>0,SHAPEH>0,DIM_4>0,SHAPE=114),7,0)","v":0},{"$f":"IF(S59>0,\"Angle @ Sill & Leg:\",0)","v":0},{"$f":"IF(S59>0,45,0)","v":0},null,null,null,null,null,57,1702,23.5,14,72,72,144]
[null,null,{"$f":"IF(AND(SHAPEW>0,SHAPEH>0,SHAPE=B58,D63<C59),1,0)","v":0},{"$f":"IF(AND(SHAPEW>0,OFFSET>0,SHAPE=B58,SHAPEW>D59),1,0)","v":0},{"$f":"IF(AND(SHAPEW>0,SHAPEH>0,SHAPE=B58,OR(SHAPEW<E59,SHAPEH<E59)),1,0)","v":0},{"$f":"IF(AND(SHAPEW>0,OFFSET>0,SHAPEH>0,SHAPE=B58,(SHAPEW+SHAPEH)>F59),1,0)","v":0},{"$f":"IF(AND(SHAPEW>0,SHAPEH>0,SHAPE=B58,OR(H65>G59,H64>G59)),1,0)","v":0},{"$f":"IF(AND(SHAPEH>0,OFFSET>0,SHAPE=115,SHAPEH>H59),1,0)","v":0},{"$f":"IF(AND(SHAPEH>0,OFFSET>0,SHAPE=115,SHAPEH<I59),1,0)","v":0},null,null,null,null,null,null,null,null,114,{"$f":"IF(AND(SHAPEW>0,SHAPEH>0,DIM_4>0,SHAPE=114),8,0)","v":0},{"$f":"IF(S60>0,\"Cut L @ Sill & Leg:\",0)","v":0},{"$f":"IF(S60>0,J53,0)","v":0},{"$f":"IF(AND(S60>0,SHAPE=$B$48,J53>10.25),1,0)","v":0},null,null,null,null,58,1703,48.5,14,108,72,168,"Width > 96, Height Must be < 60"]
[null,null,{"$f":"MAX(C60:I60)","v":0},{"$f":"IF(AND(SHAPE=B58,C61=1),1,0)","v":0},{"$f":"IF(AND(SHAPEW>0,SHAPEH>0,SHAPEH=SHAPEW),1,0)","v":0},{"$f":"IF(AND(SHAPE=115,E61=1),\"THIS IS A QUARTER ROUND\",IF(AND(SHAPE=115,SHAPEW>0,C60>0),\"RADIUS MUST BE GREATER THAN \"&C59,IF(AND(SHAPE=115,D66>0,D66<GlassMinW),\"Glass Width is Under Minimum\",IF(AND(SHAPE=115,D65>0,D65<GlassMinH),\"Glass Height is Under Minimum\",\"\"))))","v":""},null,null,null,null,null,null,null,null,null,null,null,114,{"$f":"IF(AND(SHAPEW>0,SHAPEH>0,DIM_4>0,SHAPE=114),9,0)","v":0},{"$f":"IF(S61>0,\"Angle @ Leg & Arc:\",0)","v":0},{"$f":"IF(S61>0,J55,0)","v":0},null,null,null,null,null,59,1704,11.5,11.5,72,96,156,"Width > 54, Height Must be < 84 - Dims Are Reversible"]
[null,null,null,null,null,null,null,null,null,null,null,null,null,null,null,null,null,114,{"$f":"IF(AND(SHAPEW>0,SHAPEH>0,DIM_4>0,SHAPE=114),10,0)","v":0},{"$f":"IF(S62>0,\"Cut L @ Leg & Arc:\",0)","v":0},{"$f":"IF(S62>0,J54,0)","v":0},{"$f":"IF(AND(S62>0,SHAPE=$B$48,J54>10.25),1,0)","v":0},null,null,null,null,60,1709,37,14,108,72,168,"Width > 96, Height Must be < 60"]
[null,null,"Frame Radius",{"$f":"IF(AND(SHAPEW>0,SHAPEH>0,OFFSET>0,SHAPE=115),IF(SHAPEH>SHAPEW,(SHAPEW/2)+((SHAPEH*2)^2/(8*SHAPEW)),((SHAPEW)^2+SHAPEH^2)/(2*SHAPEH)),0)","v":0},null,null,"Cut Angle",{"$f":"IF(AND(SHAPEW>0,SHAPEH>0,OFFSET>0,SHAPE=115),IF(SHAPEW>SHAPEH,DEGREES(ATAN(CUTOFFSET/(SHAPEW-(E66+CUTOFFSET)))),DEGREES(ATAN(CUTOFFSET/(SHAPEH-(E65+CUTOFFSET))))),0)","v":0},null,null,null,null,null,null,null,null,null,114,{"$f":"IF(AND(SHAPEW>0,SHAPEH>0,DIM_4>0,SHAPE=114),11,0)","v":0},{"$f":"IF(S63>0,\"Max Width:\",0)","v":0},{"$f":"IF(S63>0,D49,0)","v":0},{"$f":"IF(AND(S63>0,SHAPEW>0,SHAPEW>U63),1,0)","v":0},null,null,null,null,61,1720,29,25,96,84,180]
[null,null,"Glass Radius",{"$f":"IF(AND(SHAPEW>0,SHAPEH>0,OFFSET>0,SHAPE=115),D63-OFFSET,0)","v":0},{"$f":"IF(AND(SHAPEW>0,SHAPEH>0,OFFSET>0,SHAPE=115),D63-CUTOFFSET,0)","v":0},null,"CUT Length",{"$f":"IF(AND(SHAPEW>0,SHAPEH>0,OFFSET>0,SHAPE=115),SQRT(CUTOFFSET^2+((SHAPEW-(E66+CUTOFFSET))^2)),0)","v":0},null,null,null,null,null,null,null,null,null,114,{"$f":"IF(AND(SHAPEW>0,SHAPEH>0,DIM_4>0,SHAPE=114),12,0)","v":0},{"$f":"IF(S64>0,\"Max Height:\",0)","v":0},{"$f":"IF(S64>0,E49,0)","v":0},{"$f":"IF(AND(S64>0,SHAPEH>0,SHAPEH>U64),1,0)","v":0},null,null,null,null,62,1730,44,25,108,84,192]
[null,null,"Glass Height",{"$f":"IF(AND(SHAPEW>0,SHAPEH>0,OFFSET>0,SHAPE=115),IF(SHAPEW>SHAPEH,SHAPEH-((OFFSET*2)+H67),((2*SQRT((D66+H67)*((2*D64)-(D66+H67))))/2)-OFFSET),0)","v":0},{"$f":"IF(AND(SHAPEW>0,SHAPEH>0,OFFSET>0,SHAPE=115),IF(SHAPEW>SHAPEH,SHAPEH-((CUTOFFSET*2)+H68),SHAPEH-CUTOFFSET-SQRT(H65^2-CUTOFFSET^2)),0)","v":0},null,"Cut L @ Peak",{"$f":"IF(AND(SHAPEW>0,SHAPEH>0,OFFSET>0,SHAPE=115),SQRT((SHAPEH-CUTOFFSET-(IF(SHAPEW>SHAPEH,SHAPEH-((CUTOFFSET*2)+H68),((2*SQRT((E66+H68)*((2*E64)-(E66+H68))))/2)-CUTOFFSET)))^2+CUTOFFSET^2),0)","v":0},null,null,null,null,null,null,null,null,null,114,{"$f":"IF(AND(SHAPEW>0,SHAPEH>0,DIM_4>0,SHAPE=114),13,0)","v":0},{"$f":"IF(S65>0,\"Max UI:\",0)","v":0},{"$f":"IF(S65>0,F49,0)","v":0},{"$f":"IF(AND(S65>0,F50>0),1,0)","v":0},null,null,null,null,63,1900,14.25,25,52,96,144,"Width > 48, Height Must be < 84 - Heights > 84 Must be Oriel"]
[null,null,"Glass Width",{"$f":"IF(AND(SHAPEW>0,SHAPEH>0,OFFSET>0,SHAPE=115),IF(SHAPEW>SHAPEH,((2*SQRT((D65+H67)*((2*D64)-(D65+H67))))/2)-OFFSET,SHAPEW-((OFFSET*2)+H67)),0)","v":0},{"$f":"IF(AND(SHAPEW>0,SHAPEH>0,OFFSET>0,SHAPE=115),IF(SHAPEW>SHAPEH,((2*SQRT((E65+H68)*((2*E64)-(E65+H68))))/2)-CUTOFFSET,SHAPEW-((CUTOFFSET*2)+H68)),0)","v":0},null,"Cut Angle @ Peak",{"$f":"IF(AND(SHAPEW>0,SHAPEH>0,OFFSET>0,SHAPE=115),90-(DEGREES(ACOS(CUTOFFSET/H65))),0)","v":0},null,null,null,null,null,null,null,null,null,114,{"$f":"IF(AND(SHAPEW>0,SHAPEH>0,DIM_4>0,SHAPE=114),14,0)","v":0},{"$f":"IF(S66>0,\"Arc Length:\",0)","v":0},{"$f":"IF(S66>0,J56,0)","v":0},{"$f":"IF(AND(S66>0,J56>157),1,0)","v":0},null,null,null,null,64,1902,23.5,14,84,72,144,"Width > 72, Height Must be < 60"]
[null,null,null,null,null,null,"Difference",{"$f":"IF(AND(SHAPEW>0,SHAPEH>0,OFFSET>0,SHAPE=115),D64-(D64*(COS((2*(ASIN((OFFSET*2)/(2*D64))))/2))),0)","v":0},null,null,null,null,null,null,null,null,null,115,{"$f":"IF(AND(SHAPEW>0,SHAPEH>0,SHAPE=115),1,0)","v":0},{"$f":"IF(S67>0,\"Frame Radius:\",0)","v":0},{"$f":"IF(S67>0,D63,0)","v":0},{"$f":"IF(AND(S67>0,C60>0),1,0)","v":0},null,null,null,null,65,1903,48.5,14,108,72,168,"Width > 96, Height Must be < 60"]
[null,null,null,null,null,null,"Difference",{"$f":"IF(AND(SHAPEW>0,SHAPEH>0,OFFSET>0,SHAPE=115),E64-(E64*(COS((2*(ASIN((CUTOFFSET*2)/(2*E64))))/2))),0)","v":0},null,null,null,null,null,null,null,null,null,115,{"$f":"IF(AND(SHAPEW>0,SHAPEH>0,SHAPE=115),2,0)","v":0},{"$f":"IF(S68>0,\"Glass Radius:\",0)","v":0},{"$f":"IF(S68>0,D64,0)","v":0},null,null,null,null,null,66,1904,11.5,11.5,72,96,156,"Width > 54, Height Must be < 84 - Dims Are Reversible"]
[null,null,null,null,null,null,null,null,null,null,null,null,null,null,null,null,null,115,{"$f":"IF(AND(SHAPEW>0,SHAPEH>0,SHAPE=115),3,0)","v":0},{"$f":"IF(S69>0,\"Glass Width:\",0)","v":0},{"$f":"IF(S69>0,D66,0)","v":0},{"$f":"IF(AND(U69>0,U69<GlassMinW),1,0)","v":0},null,null,null,null,67,1909,37,14,108,72,168,"Width > 96, Height Must be < 60"]
[null,null,null,null,null,null,null,null,null,null,null,null,null,null,null,null,null,115,{"$f":"IF(AND(SHAPEW>0,SHAPEH>0,SHAPE=115),4,0)","v":0},{"$f":"IF(S70>0,\"Glass Height:\",0)","v":0},{"$f":"IF(S70>0,D65,0)","v":0},{"$f":"IF(AND(U70>0,U70<GlassMinH),1,0)","v":0},null,null,null,null,68,1920,29,25,96,84,180]
[null,116,"Min R","Max W","Max UI","Max UI","Cut L","Dim. 4",null,null,null,null,null,null,null,null,null,115,{"$f":"IF(AND(SHAPEW>0,SHAPEH>0,SHAPE=115),5,0)","v":0},{"$f":"IF(S71>0,\"Angle @ Sill & Arc:\",0)","v":0},{"$f":"IF(S71>0,H63,0)","v":0},null,null,null,null,null,69,1930,44,25,108,84,192]
[null,{"$f":"EXT","v":1},{"$f":"MIN_R","v":""},{"$f":"MAX_W","v":""},{"$f":"MAX_H","v":""},{"$f":"MAX_UI","v":""},{"$f":"CUT_LENGTH","v":""},{"$f":"MIN_LEG","v":""},null,null,null,null,null,null,null,null,null,115,{"$f":"IF(AND(SHAPEW>0,SHAPEH>0,SHAPE=115),6,0)","v":0},{"$f":"IF(S72>0,\"Cut L @ Sill & Arc:\",0)","v":0},{"$f":"IF(S72>0,H64,0)","v":0},{"$f":"IF(AND(S72>0,SHAPE=114,G60>10.25),1,0)","v":0},null,null,null,null,70,1901,16,25,52,84,132,"Width > 48, Height Must be < 76"]
[null,null,{"$f":"IF(AND(SHAPEW>0,SHAPEH>0,SHAPE=B71,D76<C72),1,0)","v":0},{"$f":"IF(AND(SHAPEW>0,OFFSET>0,SHAPE=B71,SHAPEW>D72),1,0)","v":0},{"$f":"IF(AND(SHAPEW>0,OFFSET>0,SHAPE=B71,SHAPEH>E72),1,0)","v":0},{"$f":"IF(AND(SHAPEW>0,SHAPEH>0,OFFSET>0,SHAPE=B71,(SHAPEW+SHAPEH)>F72),1,0)","v":0},{"$f":"IF(AND(SHAPEW>0,SHAPEH>0,SHAPE=B71,OR(H77>G72,H78>G72,H80>G72)),1,0)","v":0},{"$f":"IF(AND(SHAPEW>0,SHAPE=B71,DIM_4<H72),1,0)","v":0},null,null,null,null,null,null,null,null,null,115,{"$f":"IF(AND(SHAPEW>0,SHAPEH>0,SHAPE=115),7,0)","v":0},{"$f":"IF(S73>0,\"Angle @ Peak:\",0)","v":0},{"$f":"IF(S73>0,H66,0)","v":0},null,null,null,null,null,71,1914,11.5,11.5,72,96,156,"Width > 54, Height Must be < 84 - Dims Are Reversible"]
[null,null,{"$f":"MAX(C73:H73)","v":0},{"$f":"IF(AND(SHAPE=B71,C74=1),1,0)","v":0},null,null,{"$f":"IF(AND(SHAPE=116,SHAPEW>0,C73>0),\"RADIUS MUST BE GREATER THAN \"&C72,IF(AND(SHAPE=116,D79>0,D79<GlassMinW),\"Glass Width is Under Minimum\",IF(AND(SHAPE=116,D78>0,D78<GlassMinH),\"Glass Height is Under Minimum\",IF(AND(SHAPE=116,SHAPEW>0,SHAPEH>0,DIM_4>0,SHAPEW=(SHAPEH-DIM_4)),\"This is a 1/4 Round with Extended Leg\",\"\"))))","v":""},null,null,null,null,null,null,null,null,null,null,115,{"$f":"IF(AND(SHAPEW>0,SHAPEH>0,SHAPE=115),8,0)","v":0},{"$f":"IF(S74>0,\"Cut L @ Peak:\",0)","v":0},{"$f":"IF(S74>0,H65,0)","v":0},{"$f":"IF(AND(S74>0,SHAPE=$B$48,L68>10.25),1,0)","v":0},null,null,null,null,72,1921,36,25,96,84,180]
[null,null,null,null,null,null,null,null,null,null,null,null,null,null,null,null,null,115,{"$f":"IF(AND(SHAPEW>0,SHAPEH>0,SHAPE=115),9,0)","v":0},{"$f":"IF(S75>0,\"Min Height:\",0)","v":0},{"$f":"IF(S75>0,I59,0)","v":0},{"$f":"IF(AND(S75>0,SHAPEW>0,SHAPEH<U75),1,0)","v":0},null,null,null,null,73,1931,54,25,108,84,192]
[null,null,"Frame Radius",{"$f":"IF(AND(SHAPEW>0,SHAPEH>0,OFFSET>0,DIM_4>0,SHAPE=B71,SHAPEW>(SHAPEH-DIM_4)),(((SHAPEW*2)/2)^2+(SHAPEH-DIM_4)^2)/(2*(SHAPEH-DIM_4)),IF(AND(SHAPEW>0,SHAPEH>0,OFFSET>0,DIM_4>0,SHAPE=B71,SHAPEW<=(SHAPEH-DIM_4)),(SHAPEW/2)+(((SHAPEH-DIM_4)*2)^2)/(8*SHAPEW),0))","v":0},null,null,"Angle @ Peak",{"$f":"IF(AND(SHAPEW>0,SHAPEH>0,DIM_4>0,OFFSET>0,SHAPE=116),90-(DEGREES(ACOS(CUTOFFSET/H78))),0)","v":0},null,null,null,null,null,null,null,null,null,115,{"$f":"IF(AND(SHAPEW>0,SHAPEH>0,SHAPE=115),10,0)","v":0},{"$f":"IF(S76>0,\"Max Width:\",0)","v":0},{"$f":"IF(S76>0,D59,0)","v":0},{"$f":"IF(AND(S76>0,SHAPEW>0,SHAPEW>U76),1,0)","v":0},null,null,null,null,74,"S140",20,43,52,72,120]
[null,null,"Glass Radius",{"$f":"IF(AND(SHAPEW>0,SHAPEH>0,OFFSET>0,DIM_4>0,SHAPE=B71),D76-OFFSET,0)","v":0},{"$f":"IF(AND(SHAPEW>0,SHAPEH>0,OFFSET>0,DIM_4>0,SHAPE=B71),D76-CUTOFFSET,0)","v":0},null,"Cut L @ Sill & Vert",{"$f":"IF(AND(SHAPEW>0,SHAPEH>0,OFFSET>0,DIM_4>0,SHAPE=B71),SQRT(CUTOFFSET^2+((SHAPEW-E79)/2)^2),0)","v":0},null,null,null,null,null,null,null,null,null,115,{"$f":"IF(AND(SHAPEW>0,SHAPEH>0,SHAPE=115),11,0)","v":0},{"$f":"IF(S77>0,\"Max Height:\",0)","v":0},{"$f":"IF(S77>0,H59,0)","v":0},{"$f":"IF(AND(S77>0,SHAPEH>0,SHAPEH>U77),1,0)","v":0},null,null,null,null,75,"S144",16,43,52,72,120]
[null,null,"Glass Height",{"$f":"IF(AND(SHAPEW>0,SHAPEH>0,OFFSET>0,DIM_4>0,SHAPE=B71),SHAPEH-((OFFSET*2)+I80),0)","v":0},{"$f":"IF(AND(SHAPEW>0,SHAPEH>0,OFFSET>0,DIM_4>0,SHAPE=B71),SHAPEH-((CUTOFFSET*2)+K80),0)","v":0},null,"Cut L @ Peak",{"$f":"IF(AND(SHAPEH>0,OFFSET>0,DIM_4>0,SHAPE=B71),SQRT(CUTOFFSET^2+(SHAPEH-(E78+CUTOFFSET))^2),0)","v":0},{"$f":"IF(AND(OFFSET>0,SHAPEW>0,SHAPEH>0,SHAPE=B71,SHAPEW>=(SHAPEH-DIM_4)),2*(ASIN((OFFSET*2)/(2*D77))),IF(AND(OFFSET>0,SHAPEW>0,SHAPEH>0,SHAPE=B71,SHAPEW<(SHAPEH-DIM_4)),2*(ASIN(((D77-D79)*2)/(2*D77))),0))","v":0},"F",{"$f":"IF(AND(OFFSET>0,SHAPEW>0,SHAPEH>0,SHAPE=B71,SHAPEW>=(SHAPEH-DIM_4)),2*(ASIN((CUTOFFSET*2)/(2*E77))),IF(AND(OFFSET>0,SHAPEW>0,SHAPEH>0,SHAPE=B71,SHAPEW<(SHAPEH-DIM_4)),2*(ASIN(((E77-E79)*2)/(2*E77))),0))","v":0},null,null,null,null,null,null,115,{"$f":"IF(AND(SHAPEW>0,SHAPEH>0,SHAPE=115),12,0)","v":0},{"$f":"IF(S78>0,\"Max UI:\",0)","v":0},{"$f":"IF(S78>0,F59,0)","v":0},{"$f":"IF(AND(S78>0,F60>0),1,0)","v":0},null,null,null,null,76,"S146",16,43,52,72,120]
[null,null,"Glass Width",{"$f":"IF(AND(SHAPEW>0,SHAPEH>0,OFFSET>0,DIM_4>0,SHAPE=B71),SHAPEW-(2*OFFSET),0)","v":0},{"$f":"IF(AND(SHAPEW>0,SHAPEH>0,OFFSET>0,DIM_4>0,SHAPE=B71),SHAPEW-(2*CUTOFFSET),0)","v":0},null,"Cut Angle @ Leg & Arc",{"$f":"IF(AND(SHAPEW>0,SHAPEH>0,DIM_4>0,OFFSET>0,SHAPE=B71),DEGREES(ACOS(CUTOFFSET/H80)),0)","v":0},{"$f":"IF(AND(SHAPEW>0,SHAPEH>0,OFFSET>0,DIM_4>0,SHAPE=B71),D77*COS(I78/2),0)","v":0},"d",{"$f":"IF(AND(SHAPEW>0,SHAPEH>0,OFFSET>0,DIM_4>0,SHAPE=B71),E77*COS(K78/2),0)","v":0},null,null,null,null,null,null,116,{"$f":"IF(AND(SHAPEW>0,SHAPEH>0,DIM_4>0,SHAPE=116),1,0)","v":0},{"$f":"IF(S79>0,\"Frame Radius:\",0)","v":0},{"$f":"IF(S79>0,D76,0)","v":0},{"$f":"IF(AND(S79>0,C73>0),1,0)","v":0},null,null,null,null,77,"0151","19","16","48","48","96"]
[null,null,"Glass Leg Height",{"$f":"IF(AND(SHAPEW>0,SHAPE=B71,DIM_4>0,OFFSET>0,SHAPEW>(SHAPEH-DIM_4)),DIM_4-(OFFSET+((D76*COS((2*(ASIN((SHAPEW*2)/(2*D76))))/2))-(D77*COS((2*(ASIN(((SHAPEW*2)-(2*OFFSET))/(2*D77))))/2)))),IF(AND(SHAPEW>0,SHAPE=B71,DIM_4>0,OFFSET>0,SHAPEW<=(SHAPEH-DIM_4)),DIM_4-OFFSET,0))","v":0},{"$f":"IF(AND(SHAPEW>0,SHAPE=B71,DIM_4>0,OFFSET>0,SHAPEW>(SHAPEH-DIM_4)),DIM_4-(CUTOFFSET+((D76*COS((2*(ASIN((SHAPEW*2)/(2*D76))))/2))-(E77*COS((2*(ASIN(((SHAPEW*2)-(2*CUTOFFSET))/(2*E77))))/2)))),IF(AND(SHAPEW>0,SHAPE=B71,DIM_4>0,CUTOFFSET>0,SHAPEW<=(SHAPEH-DIM_4)),DIM_4-CUTOFFSET,0))","v":0},null,"Cut L @ Leg & Arc",{"$f":"IF(AND(SHAPEW>0,SHAPEH>0,DIM_4>0,OFFSET>0,SHAPE=B71),SQRT(CUTOFFSET^2+((DIM_4-CUTOFFSET)-E80)^2),0)","v":0},{"$f":"IF(AND(SHAPEW>0,SHAPEH>0,OFFSET>0,DIM_4>0,SHAPE=B71,SHAPEW>=(SHAPEH-DIM_4)),D77-I79,IF(AND(SHAPEW>0,SHAPEH>0,OFFSET>0,DIM_4>0,SHAPE=B71,SHAPEW<(SHAPEH-DIM_4)),(SHAPEH-DIM_4)-I79-OFFSET,0))","v":0},"h",{"$f":"IF(AND(SHAPEW>0,SHAPEH>0,OFFSET>0,DIM_4>0,SHAPE=B71,SHAPEW>=(SHAPEH-DIM_4)),E77-K79,IF(AND(SHAPEW>0,SHAPEH>0,OFFSET>0,DIM_4>0,SHAPE=B71,SHAPEW<(SHAPEH-DIM_4)),(SHAPEH-DIM_4)-K79-CUTOFFSET,0))","v":0},null,null,null,null,null,null,116,{"$f":"IF(AND(SHAPEW>0,SHAPEH>0,DIM_4>0,SHAPE=116),2,0)","v":0},{"$f":"IF(S80>0,\"Frame Leg:\",0)","v":0},{"$f":"IF(S80>0,DIM_4,0)","v":0},{"$f":"IF(AND(S80>0,H73>0),1,0)","v":0},null,null,null,null,78,"0152","19","32","48","96","144"]
[null,null,null,null,null,null,null,null,null,null,null,null,null,null,null,null,null,116,{"$f":"IF(AND(SHAPEW>0,SHAPEH>0,DIM_4>0,SHAPE=116),3,0)","v":0},{"$f":"IF(S81>0,\"Glass Radius:\",0)","v":0},{"$f":"IF(S81>0,D77,0)","v":0},null,null,null,null,null,79,"S153","19","48","48","96","144"]
[null,null,null,null,null,null,null,null,null,null,null,null,null,null,null,null,null,116,{"$f":"IF(AND(SHAPEW>0,SHAPEH>0,DIM_4>0,SHAPE=116),4,0)","v":0},{"$f":"IF(S82>0,\"Glass Width:\",0)","v":0},{"$f":"IF(S82>0,D79,0)","v":0},{"$f":"IF(AND(U82>0,U82<GlassMinW),1,0)","v":0},null,null,null,null,80,"0154","19","32","48","96","144"]
[null,null,null,null,null,null,null,null,null,null,null,null,null,null,null,null,null,116,{"$f":"IF(AND(SHAPEW>0,SHAPEH>0,DIM_4>0,SHAPE=116),5,0)","v":0},{"$f":"IF(S83>0,\"Glass Height:\",0)","v":0},{"$f":"IF(S83>0,D78,0)","v":0},{"$f":"IF(AND(U83>0,U83<GlassMinH),1,0)","v":0},null,null,null,null,81,"0155","19","32","48","96","144"]
[null,117,"Min R","Max W","Max UI",null,null,"Point B from center:",{"$f":"IF(AND(SHAPEW>0,SHAPEH>0,OFFSET>0,SHAPE=117),(SHAPEW/2)-I92,0)","v":0},{"$f":"IF(AND(SHAPEW>0,SHAPEH>0,OFFSET>0,SHAPE=117),(SHAPEW/2)-I92,0)","v":0},null,null,null,null,null,null,null,116,{"$f":"IF(AND(SHAPEW>0,SHAPEH>0,DIM_4>0,SHAPE=116),6,0)","v":0},{"$f":"IF(S84>0,\"Glass Leg:\",0)","v":0},{"$f":"IF(S84>0,D80,0)","v":0},null,null,null,null,null,82,"0170","13","11.5","96",96,"154"]
[null,{"$f":"EXT","v":1},{"$f":"MIN_R","v":""},{"$f":"MAX_W","v":""},{"$f":"MAX_UI","v":""},null,null,"Edge to Peak:",{"$f":"IF(AND(SHAPEW>0,SHAPEH>0,OFFSET>0,SHAPE=117),SQRT((SHAPEW/2)^2+SHAPEH^2),0)","v":0},{"$f":"IF(AND(SHAPEW>0,SHAPEH>0,SHAPE=$B$84,OFFSET>0),J84/TAN(I90),0)","v":0},null,null,null,null,null,null,null,116,{"$f":"IF(AND(SHAPEW>0,SHAPEH>0,DIM_4>0,SHAPE=116),7,0)","v":0},{"$f":"IF(S85>0,\"Angle @ Sill & Vert:\",0)","v":0},{"$f":"IF(S85>0,45,0)","v":0},null,null,null,null,null,83,"0171","16","19","36","78","114"]
[null,null,{"$f":"IF(AND(SHAPEW>0,SHAPEH>0,SHAPE=B84,OR(I92<C85,I93<C85)),1,0)","v":0},{"$f":"IF(AND(SHAPEW>0,OFFSET>0,SHAPE=B84,SHAPEW>D85),1,0)","v":0},{"$f":"IF(AND(SHAPEW>0,SHAPEH>0,OFFSET>0,SHAPE=B84,(SHAPEW+SHAPEH)>E85),1,0)","v":0},null,null,"Peak Radius:",{"$f":"IF(AND(SHAPEW>0,SHAPEH>0,OFFSET>0,SHAPE=117),(SHAPEW/2)-SHAPEH,0)","v":0},null,null,null,null,null,null,null,null,116,{"$f":"IF(AND(SHAPEW>0,SHAPEH>0,DIM_4>0,SHAPE=116),8,0)","v":0},{"$f":"IF(S86>0,\"Cut L @ Sill & Vert:\",0)","v":0},{"$f":"IF(S86>0,H77,0)","v":0},{"$f":"IF(AND(S86>0,H77>10.25),1,0)","v":0},null,null,null,null,84,"0172","32","19","72","78","150"]
[null,null,{"$f":"MAX(C86:F86)","v":0},{"$f":"IF(AND(SHAPE=B84,C87=1),1,0)","v":0},{"$f":"IF(AND(SHAPEW>0,SHAPEH>0,OFFSET>0,SHAPE=117,SHAPEH>=SHAPEW/2),1,0)","v":0},{"$f":"IF(AND(SHAPE=117,SHAPEW>0,C86>0),\"RADIUS MUST BE GREATER THAN \"&C85,IF(AND(SHAPE=117,J91>0,J91<GlassMinW),\"Glass Width is Under Minimum\",IF(AND(SHAPE=117,J92>0,J92<GlassMinH),\"Glass Height is Under Minimum\",\"\")))","v":""},null,"Hyp. From left to peak:",{"$f":"IF(AND(SHAPEW>0,SHAPEH>0,OFFSET>0,SHAPE=117),I85-I86,0)","v":0},null,null,null,null,null,null,null,null,116,{"$f":"IF(AND(SHAPEW>0,SHAPEH>0,DIM_4>0,SHAPE=116),9,0)","v":0},{"$f":"IF(S87>0,\"Angle @ Leg & Arc:\",0)","v":0},{"$f":"IF(S87>0,H79,0)","v":0},null,null,null,null,null,85,"0173","64","19","120","78","198"]
[null,null,null,null,null,null,null,"Angle of Cut:",{"$f":"IF(AND(SHAPEW>0,SHAPEH>0,OFFSET>0,SHAPE=117),DEGREES(ATAN(SHAPEH/(SHAPEW/2))),0)","v":0},null,null,null,null,null,null,null,null,116,{"$f":"IF(AND(SHAPEW>0,SHAPEH>0,DIM_4>0,SHAPE=116),10,0)","v":0},{"$f":"IF(S88>0,\"Cut L @ Leg & Arc:\",0)","v":0},{"$f":"IF(S88>0,H80,0)","v":0},{"$f":"IF(AND(S88>0,H80>10.25),1,0)","v":0},null,null,null,null,86,"0179","48","19","108","78","186"]
[null,null,null,null,null,null,null,"1/2 Edge to Peak:",{"$f":"IF(AND(SHAPEW>0,SHAPEH>0,OFFSET>0,SHAPE=117),I87/2,0)","v":0},null,null,null,null,null,null,null,null,116,{"$f":"IF(AND(SHAPEW>0,SHAPEH>0,DIM_4>0,SHAPE=116),11,0)","v":0},{"$f":"IF(S89>0,\"Angle @ Peak:\",0)","v":0},{"$f":"IF(S89>0,H76,0)","v":0},null,null,null,null,null,87,"1105","59.375","79.5",60,80,"140"]
[null,null,null,null,null,null,null,"Angle of Edge to Peak:",{"$f":"IF(AND(SHAPEW>0,SHAPEH>0,OFFSET>0,SHAPE=117),ACOS((SHAPEW/2)/I85),0)","v":0},{"$f":"IF(AND(SHAPEW>0,SHAPEH>0,OFFSET>0,SHAPE=117),2*ACOS(((I92-OFFSET)-((I92-(OFFSET*2))))/(I92-OFFSET)),0)","v":0},"F",null,null,null,null,null,null,116,{"$f":"IF(AND(SHAPEW>0,SHAPEH>0,DIM_4>0,SHAPE=116),12,0)","v":0},{"$f":"IF(S90>0,\"Cut L @ Peak:\",0)","v":0},{"$f":"IF(S90>0,H78,0)","v":0},{"$f":"IF(AND(S90>0,H78>10.25),1,0)","v":0},null,null,null,null,88,"1106","71.375","79.5",72,96,168]
[null,null,null,"Major Arc Length:",{"$f":"IF(AND(SHAPEW>0,SHAPEH>0),((((SHAPEW/2)-(SQRT(((((SQRT((SHAPEW/2)^2+SHAPEH^2))-((SHAPEW/2)-SHAPEH))/2)*TAN((ACOS((SHAPEW/2)/(SQRT((SHAPEW/2)^2+SHAPEH^2))))))^2+(((SQRT((SHAPEW/2)^2+SHAPEH^2))-((SHAPEW/2)-SHAPEH))/2)^2)))/(TAN((ACOS((SHAPEW/2)/(SQRT((SHAPEW/2)^2+SHAPEH^2)))))))+SHAPEH)*((ACOS((SHAPEW/2)/(SQRT((SHAPEW/2)^2+SHAPEH^2))))*2),0)","v":0},null,null,"Distance to Major:",{"$f":"IF(AND(SHAPEW>0,SHAPEH>0,OFFSET>0,SHAPE=117),I89*TAN(I90),0)","v":0},{"$f":"IF(AND(SHAPEW>0,SHAPEH>0,OFFSET>0,SHAPE=117),SHAPEW-(2*(OFFSET+(((2*(I92-OFFSET))-(2*(I92-OFFSET)*(SIN(J90/2))))/2))),0)","v":0},"Glass Width",null,null,null,null,null,null,116,{"$f":"IF(AND(SHAPEW>0,SHAPEH>0,DIM_4>0,SHAPE=116),13,0)","v":0},{"$f":"IF(S91>0,\"Max Width:\",0)","v":0},{"$f":"IF(S91>0,D72,0)","v":0},{"$f":"IF(AND(S91>0,SHAPEW>0,SHAPEW>U91),1,0)","v":0},null,null,null,null,89,"1108","95.375","79.5",96,80,"176"]
[null,null,null,"Minor Arc Length:",{"$f":"(SQRT(((((SQRT((SHAPEW/2)^2+SHAPEH^2))-((SHAPEW/2)-SHAPEH))/2)*TAN((ACOS((SHAPEW/2)/(SQRT((SHAPEW/2)^2+SHAPEH^2))))))^2+(((SQRT((SHAPEW/2)^2+SHAPEH^2))-((SHAPEW/2)-SHAPEH))/2)^2))*(2*(RADIANS(90-(DEGREES(ACOS((SHAPEW/2)/(SQRT((SHAPEW/2)^2+SHAPEH^2))))))))","v":{"$error":"#DIV/0!"}},null,null,"Minor Radius:",{"$f":"IF(AND(SHAPEW>0,SHAPEH>0,OFFSET>0,SHAPE=117),SQRT(I91^2+I89^2),0)","v":0},{"$f":"IF(AND(SHAPEW>0,SHAPEH>0,OFFSET>0,SHAPE=117),SHAPEH-(OFFSET*2),0)","v":0},"Glass Height",null,null,null,null,null,null,116,{"$f":"IF(AND(SHAPEW>0,SHAPEH>0,DIM_4>0,SHAPE=116),14,0)","v":0},{"$f":"IF(S92>0,\"Max Height:\",0)","v":0},{"$f":"IF(S92>0,E72,0)","v":0},{"$f":"IF(AND(S92>0,SHAPEH>0,SHAPEH>U92),1,0)","v":0},null,null,null,null,90,"1109","107.375","79.5",108,96,204]
[null,null,null,"Arc Length:",{"$f":"E91+E92","v":{"$error":"#DIV/0!"}},null,null,"Major Radius:",{"$f":"IF(AND(SHAPEW>0,SHAPEH>0,SHAPE=$B$84,OFFSET>0),J85+SHAPEH,0)","v":0},null,null,null,null,null,null,null,null,116,{"$f":"IF(AND(SHAPEW>0,SHAPEH>0,DIM_4>0,SHAPE=116),15,0)","v":0},{"$f":"IF(S93>0,\"Max UI:\",0)","v":0},{"$f":"IF(S93>0,F72,0)","v":0},{"$f":"IF(AND(S93>0,F73>0),1,0)","v":0},null,null,null,null,91,"11c5","59.5","79.5",60,80,"140"]
[null,null,null,null,null,null,null,null,null,null,null,null,null,null,null,null,null,117,{"$f":"IF(AND(SHAPEW>0,SHAPEH>0,SHAPE=117),1,0)","v":0},{"$f":"IF(S94>0,\"Frame Major R:\",0)","v":0},{"$f":"IF(S94>0,I93,0)","v":0},{"$f":"IF(AND(S94>0,I93<C85),1,0)","v":0},null,null,null,null,92,"11c6","71.5","79.5",72,80,"152"]
[null,null,null,null,null,null,null,null,null,null,null,null,null,null,null,null,null,117,{"$f":"IF(AND(SHAPEW>0,SHAPEH>0,SHAPE=117),2,0)","v":0},{"$f":"IF(S95>0,\"Frame Minor R:\",0)","v":0},{"$f":"IF(S95>0,I92,0)","v":0},{"$f":"IF(AND(S95>0,I92<C85),1,0)","v":0},null,null,null,null,93,"11c8","95.5","79.5",96,80,"176"]
[null,118,"Min R","Max W","Max UI",null,null,null,null,null,null,null,null,null,null,null,null,117,{"$f":"IF(AND(SHAPEW>0,SHAPEH>0,SHAPE=117),3,0)","v":0},{"$f":"IF(S96>0,\"Arc Length:\",0)","v":0},{"$f":"IF(S96>0,E93,0)","v":0},{"$f":"IF(AND(S96>0,E93>157),1,0)","v":{"$error":"#DIV/0!"}},null,null,null,null,94,"11c9","107.5","79.5",108,80,"188"]
[null,{"$f":"EXT","v":1},{"$f":"MIN_R","v":""},{"$f":"MAX_W","v":""},{"$f":"MAX_UI","v":""},null,null,"Frame Height:",{"$f":"IF(AND(SHAPEW>0,OFFSET>0,SHAPE=118),SHAPEW,0)","v":0},null,null,null,null,null,null,null,null,117,{"$f":"IF(AND(SHAPEW>0,SHAPEH>0,SHAPE=117),4,0)","v":0},{"$f":"IF(S97>0,\"Glass Major R:\",0)","v":0},{"$f":"IF(S97>0,I93-OFFSET,0)","v":0},null,null,null,null,null,95,"6402",48,72,96,96,192]
[null,null,{"$f":"IF(AND(SHAPEW>0,SHAPE=118,(SHAPEW/2)<C97),1,0)","v":0},{"$f":"IF(AND(SHAPEW>0,OFFSET>0,SHAPE=118,SHAPEW>D97),1,0)","v":0},{"$f":"IF(AND(SHAPEW>0,SHAPE=118,OFFSET>0,(SHAPEW+I97)>E97),1,0)","v":0},null,null,"Glass Width:",{"$f":"IF(AND(SHAPEW>0,OFFSET>0,SHAPE=118),SHAPEW-(OFFSET*2),0)","v":0},null,null,null,null,null,null,null,null,117,{"$f":"IF(AND(SHAPEW>0,SHAPEH>0,SHAPE=117),5,0)","v":0},{"$f":"IF(S98>0,\"Glass Minor R:\",0)","v":0},{"$f":"IF(S98>0,I92-OFFSET,0)","v":0},null,null,null,null,null,96,"6403",84,72,144,96,240]
[null,null,{"$f":"MAX(C98:F98)","v":0},{"$f":"IF(AND(SHAPE=B96,C99=1),1,0)","v":0},null,{"$f":"IF(AND(SHAPE=118,SHAPEW>0,C98>0),\"RADIUS MUST BE GREATER THAN\"&\" \"&C97,IF(AND(SHAPE=118,SHAPEW>0,SHAPEH>0,SHAPEW<>SHAPEH),\"WIDTH AND HEIGHT MUST BE EQUAL\",IF(AND(SHAPE=118,I98>0,I98<GlassMinW),\"Glass Width is Under Minimum\",IF(AND(SHAPE=118,I99>0,I99<GlassMinH),\"Glass Height is Under Minimum\",\"\"))))","v":""},null,"Glass Height:",{"$f":"IF(AND(SHAPEW>0,OFFSET>0,SHAPE=118),SHAPEW-(OFFSET*2),0)","v":0},null,null,null,null,null,null,null,null,117,{"$f":"IF(AND(SHAPEW>0,SHAPEH>0,SHAPE=117),6,0)","v":0},{"$f":"IF(S99>0,\"Glass Width:\",0)","v":0},{"$f":"IF(S99>0,J91,0)","v":0},{"$f":"IF(AND(U99>0,U99<GlassMinW),1,0)","v":0},null,null,null,null,97,"6404",96,72,144,96,240]
[null,null,null,null,null,null,null,"Frame Radius:",{"$f":"IF(AND(SHAPEW>0,OFFSET>0,SHAPE=118),SHAPEW/2,0)","v":0},null,null,null,null,null,null,null,null,117,{"$f":"IF(AND(SHAPEW>0,SHAPEH>0,SHAPE=117),7,0)","v":0},{"$f":"IF(S100>0,\"Glass Height:\",0)","v":0},{"$f":"IF(S100>0,J92,0)","v":0},{"$f":"IF(AND(U100>0,U100<GlassMinH),1,0)","v":0},null,null,null,null,98,"6405",60,80,60,96,156]
[null,null,null,null,null,null,null,"Glass Radius:",{"$f":"IF(AND(SHAPEW>0,OFFSET>0,SHAPE=118),(SHAPEW/2)-OFFSET,0)","v":0},null,null,null,null,null,null,null,null,117,{"$f":"IF(AND(SHAPEW>0,SHAPEH>0,SHAPE=117),8,0)","v":0},{"$f":"IF(S101>0,\"Max Width:\",0)","v":0},{"$f":"IF(S101>0,D85,0)","v":0},{"$f":"IF(AND(S101>0,SHAPEW>0,SHAPEW>U101),1,0)","v":0},null,null,null,null,99,"6406",72,80,72,96,168]
[null,null,null,null,null,null,null,null,null,null,null,null,null,null,null,null,null,117,{"$f":"IF(AND(SHAPEW>0,SHAPEH>0,SHAPE=117),9,0)","v":0},{"$f":"IF(S102>0,\"Max UI:\",0)","v":0},{"$f":"IF(S102>0,E85,0)","v":0},{"$f":"IF(AND(S102>0,E86>0),1,0)","v":0},null,null,null,null,100,"6408",96,80,96,96,190]
[null,null,null,null,null,null,null,null,null,null,null,null,null,null,null,null,null,118,{"$f":"IF(AND(SHAPEW>0,SHAPE=118),1,0)","v":0},{"$f":"IF(S103>0,\"Frame Width:\",0)","v":0},{"$f":"IF(S103>0,SHAPEW,0)","v":0},null,null,null,null,null,101,"6409",108,80,108,96,204]
[null,null,null,null,null,null,null,null,null,null,null,null,null,null,null,null,null,118,{"$f":"IF(AND(SHAPEW>0,SHAPE=118),2,0)","v":0},{"$f":"IF(S104>0,\"Frame Height:\",0)","v":0},{"$f":"IF(S104>0,I97,0)","v":0},null,null,null,null,null,102,"6412",144,80,144,96,240]
[null,119,"Min R","Max W","Max H","Max UI","Max sq.ft",null,null,null,null,null,null,null,null,null,null,118,{"$f":"IF(AND(SHAPEW>0,SHAPE=118),3,0)","v":0},{"$f":"IF(S105>0,\"Frame Radius:\",0)","v":0},{"$f":"IF(S105>0,I100,0)","v":0},{"$f":"IF(AND(S105>0,C98>0),1,0)","v":0},null,null,null,null,103,"6422",144,80,144,96,240]
[null,{"$f":"EXT","v":1},{"$f":"MIN_R","v":""},{"$f":"MAX_W","v":""},{"$f":"MAX_H","v":""},{"$f":"MAX_UI","v":""},{"$f":"MAX_SF","v":""},null,"Major Arc Length:",{"$f":"IF(AND(SHAPEW>0,SHAPEH>0),((((SHAPEW/2)-(SQRT(((((SQRT((SHAPEW/2)^2+SHAPEH^2))-((SHAPEW/2)-SHAPEH))/2)*TAN((ACOS((SHAPEW/2)/(SQRT((SHAPEW/2)^2+SHAPEH^2))))))^2+(((SQRT((SHAPEW/2)^2+SHAPEH^2))-((SHAPEW/2)-SHAPEH))/2)^2)))/(TAN((ACOS((SHAPEW/2)/(SQRT((SHAPEW/2)^2+SHAPEH^2)))))))+SHAPEH)*((ACOS((SHAPEW/2)/(SQRT((SHAPEW/2)^2+SHAPEH^2))))*2),0)","v":0},null,null,null,null,null,null,null,118,{"$f":"IF(AND(SHAPEW>0,SHAPE=118),4,0)","v":0},{"$f":"IF(S106>0,\"Glass Radius:\",0)","v":0},{"$f":"IF(S106>0,I101,0)","v":0},null,null,null,null,null,104,"6475",75,80,75,80,155]
[null,null,{"$f":"IF(AND(SHAPEW>0,SHAPE=119,OR(G113<C106,G114<C106)),1,0)","v":0},{"$f":"IF(AND(SHAPEW>0,OFFSET>0,SHAPE=119,SHAPEW>D106),1,0)","v":0},{"$f":"IF(AND(SHAPEH>0,OFFSET>0,SHAPE=119,SHAPEH>E106),1,0)","v":0},{"$f":"IF(AND(SHAPEW>0,SHAPEH>0,SHAPE=119,OFFSET>0,(SHAPEW+SHAPEH)>F106),1,0)","v":0},{"$f":"IF(AND(SHAPEW>0,SHAPEH>0,SHAPE=119,OFFSET>0,((SHAPEW*SHAPEH)/144)>G106),1,0)","v":0},null,"Minor Arc Length:",{"$f":"(SQRT(((((SQRT((SHAPEW/2)^2+SHAPEH^2))-((SHAPEW/2)-SHAPEH))/2)*TAN((ACOS((SHAPEW/2)/(SQRT((SHAPEW/2)^2+SHAPEH^2))))))^2+(((SQRT((SHAPEW/2)^2+SHAPEH^2))-((SHAPEW/2)-SHAPEH))/2)^2))*(2*(RADIANS(90-(DEGREES(ACOS((SHAPEW/2)/(SQRT((SHAPEW/2)^2+SHAPEH^2))))))))","v":{"$error":"#DIV/0!"}},null,null,null,null,null,null,null,118,{"$f":"IF(AND(SHAPEW>0,SHAPE=118),5,0)","v":0},{"$f":"IF(S107>0,\"Glass Width:\",0)","v":0},{"$f":"IF(S107>0,I98,0)","v":0},{"$f":"IF(AND(U107>0,U107<GlassMinW),1,0)","v":0},null,null,null,null,105,"11T5","59.375","89.5",60,94,"154"]
[null,null,{"$f":"MAX(C107:G107)","v":0},{"$f":"IF(AND(SHAPE=B105,C108=1),1,0)","v":0},null,{"$f":"IF(AND(SHAPE=119,SHAPEW>0,C107>0),\"RADIUS MUST BE GREATER THAN \"&C106,IF(AND(SHAPE=119,SHAPEW>0,SHAPEH>0,SHAPEW=SHAPEH),\"THIS IS A CIRCLE\",IF(AND(SHAPE=119,U116>0,U116<GlassMinW),\"Glass Width is Under Minimum\",IF(AND(SHAPE=119,U117>0,U117<GlassMinH),\"Glass Height is Under Minimum\",\"\"))))","v":""},null,null,"Arc Length:",{"$f":"J106+J107","v":{"$error":"#DIV/0!"}},null,null,null,null,null,null,null,118,{"$f":"IF(AND(SHAPEW>0,SHAPE=118),6,0)","v":0},{"$f":"IF(S108>0,\"Glass Height:\",0)","v":0},{"$f":"IF(S108>0,I99,0)","v":0},{"$f":"IF(AND(U108>0,U108<GlassMinH),1,0)","v":0},null,null,null,null,106,"11T6","71.375","89.5",72,94,"166"]
[null,null,null,null,null,null,null,null,null,null,null,null,null,null,null,null,null,118,{"$f":"IF(AND(SHAPEW>0,SHAPE=118),7,0)","v":0},{"$f":"IF(S109>0,\"Max Width:\",0)","v":0},{"$f":"IF(S109>0,D97,0)","v":0},{"$f":"IF(AND(S109>0,SHAPEW>0,SHAPEW>U109),1,0)","v":0},null,null,null,null,107,"11T8","95.375","89.5",96,94,"190"]
[null,null,"Point B from center:",{"$f":"IF(AND(SHAPEW>0,SHAPEH>0,OFFSET>0,SHAPE=119),(SHAPEW/2)-G113,0)","v":0},null,"1/2 Edge to Peak:",{"$f":"IF(AND(SHAPEW>0,SHAPEH>0,OFFSET>0,SHAPE=119),D113/2,0)","v":0},{"$f":"IF(AND(SHAPEW>0,SHAPEH>0,OFFSET>0,SHAPE=119),(SHAPEW/2)-G113,0)","v":0},null,null,null,null,null,null,null,null,null,118,{"$f":"IF(AND(SHAPEW>0,SHAPE=118),8,0)","v":0},{"$f":"IF(S110>0,\"Max UI:\",0)","v":0},{"$f":"IF(S110>0,E97,0)","v":0},{"$f":"IF(AND(S110>0,E98>0),1,0)","v":0},null,null,null,null,108,"11T9","107.375","89.5",108,94,"202"]
[null,null,"Edge to Peak:",{"$f":"IF(AND(SHAPEW>0,SHAPEH>0,OFFSET>0,SHAPE=119),SQRT((SHAPEW/2)^2+(SHAPEH/2)^2),0)","v":0},null,"Angle of Edge to Peak:",{"$f":"IF(AND(SHAPEW>0,SHAPEH>0,OFFSET>0,SHAPE=119),ACOS((SHAPEW/2)/D111),0)","v":0},{"$f":"IF(AND(SHAPEW>0,SHAPEH>0,OFFSET>0,SHAPE=$B$105),H110/TAN(G111),0)","v":0},null,null,null,null,null,null,null,null,null,119,{"$f":"IF(AND(SHAPEW>0,SHAPEH>0,SHAPE=119),1,0)","v":0},{"$f":"IF(S111>0,\"Frame Major R:\",0)","v":0},{"$f":"IF(S111>0,G114,0)","v":0},{"$f":"IF(AND(S111>0,SHAPEW>0,SHAPEH>0,G114<C106),1,0)","v":0},null,null,null,null,109,"5102","48","72","96","96","192"]
[null,null,"Peak Radius:",{"$f":"IF(AND(SHAPEW>0,SHAPEH>0,OFFSET>0,SHAPE=119),(SHAPEW/2)-(SHAPEH/2),0)","v":0},null,"Distance to Major:",{"$f":"IF(AND(SHAPEW>0,SHAPEH>0,OFFSET>0,SHAPE=119),G110*TAN(G111),0)","v":0},null,null,null,null,null,null,null,null,null,null,119,{"$f":"IF(AND(SHAPEW>0,SHAPEH>0,SHAPE=119),2,0)","v":0},{"$f":"IF(S112>0,\"Frame Minor R:\",0)","v":0},{"$f":"IF(S112>0,G113,0)","v":0},{"$f":"IF(AND(S112>0,SHAPEW>0,SHAPEH>0,G113<C106),1,0)","v":0},null,null,null,null,110,"5103","84","72","108","96","204"]
[null,null,"Hyp. From left to peak:",{"$f":"IF(AND(SHAPEW>0,SHAPEH>0,OFFSET>0,SHAPE=119),D111-D112,0)","v":0},null,"Minor Radius:",{"$f":"IF(AND(SHAPEW>0,SHAPEH>0,OFFSET>0,SHAPE=119),SQRT(G112^2+G110^2),0)","v":0},null,null,null,null,null,null,null,null,null,null,119,{"$f":"IF(AND(SHAPEW>0,SHAPEH>0,SHAPE=119),3,0)","v":0},{"$f":"IF(S113>0,\"Arc Length:\",0)","v":0},{"$f":"IF(S113>0,J108,0)","v":0},{"$f":"IF(AND(S113>0,SHAPEW>0,SHAPEH>0,J108>157),1,0)","v":{"$error":"#DIV/0!"}},null,null,null,null,111,"5105","58.625","79.5",60,80,"140"]
[null,null,"Angle of Cut:",{"$f":"IF(AND(SHAPEW>0,SHAPEH>0,OFFSET>0,SHAPE=119),DEGREES(ATAN((SHAPEH/2)/(SHAPEW/2))),0)","v":0},null,"Major Radius:",{"$f":"IF(AND(SHAPEW>0,SHAPEH>0,OFFSET>0,SHAPE=119),H111+(SHAPEH/2),0)","v":0},null,null,null,null,null,null,null,null,null,null,119,{"$f":"IF(AND(SHAPEW>0,SHAPEH>0,SHAPE=119),4,0)","v":0},{"$f":"IF(S114>0,\"Glass Major R:\",0)","v":0},{"$f":"IF(S114>0,G114-OFFSET,0)","v":0},null,null,null,null,null,112,"5106","70.625","79.5",72,80,"152"]
[null,null,null,null,null,null,null,null,null,null,null,null,null,null,null,null,null,119,{"$f":"IF(AND(SHAPEW>0,SHAPEH>0,SHAPE=119),5,0)","v":0},{"$f":"IF(S115>0,\"Glass Minor R:\",0)","v":0},{"$f":"IF(S115>0,G113-OFFSET,0)","v":0},null,null,null,null,null,113,"5108","94.25","79.5",96,80,"176"]
[null,null,null,null,null,null,null,null,null,null,null,null,null,null,null,null,null,119,{"$f":"IF(AND(SHAPEW>0,SHAPEH>0,SHAPE=119),6,0)","v":0},{"$f":"IF(S116>0,\"Glass Width:\",0)","v":0},{"$f":"IF(AND(S116>0,SHAPEW>0,SHAPEH>0),SHAPEW-(OFFSET*2),0)","v":0},{"$f":"IF(AND(U116>0,U116<GlassMinW),1,0)","v":0},null,null,null,null,114,"5109","105.5","79.5",108,80,"188"]
[null,120,"Min Side","Max W","Max UI","Max sq.ft",null,null,"Frame Height:",{"$f":"IF(AND(SHAPEW>0,OFFSET>0,SHAPE=120),SHAPEW,0)","v":0},null,null,null,null,null,null,null,119,{"$f":"IF(AND(SHAPEW>0,SHAPEH>0,SHAPE=119),7,0)","v":0},{"$f":"IF(S117>0,\"Glass Height:\",0)","v":0},{"$f":"IF(AND(S117>0,SHAPEW>0,SHAPEH>0),SHAPEH-(OFFSET*2),0)","v":0},{"$f":"IF(AND(U117>0,U117<GlassMinH),1,0)","v":0},null,null,null,null,115,"5175","74.5","79.5",75,80,"155"]
[null,{"$f":"EXT","v":1},{"$f":"MIN_LEG","v":""},{"$f":"MAX_W","v":""},{"$f":"MAX_UI","v":""},{"$f":"MAX_SF","v":""},null,null,"Leg Length:",{"$f":"IF(AND(SHAPEW>0,OFFSET>0,SHAPE=120),((TAN(30*(PI()/180)))*SHAPEW/2)*2,0)","v":0},null,null,null,null,null,null,null,119,{"$f":"IF(AND(SHAPEW>0,SHAPEH>0,SHAPE=119),8,0)","v":0},{"$f":"IF(S118>0,\"Max Width:\",0)","v":0},{"$f":"IF(S118>0,D106,0)","v":0},{"$f":"IF(AND(S118>0,SHAPEW>0,SHAPEW>U118),1,0)","v":0},null,null,null,null,116,"6102","48","72","96","96","180"]
[null,null,{"$f":"IF(AND(SHAPEW>0,SHAPE=120,J118<C118),1,0)","v":0},{"$f":"IF(AND(SHAPEW>0,OFFSET>0,SHAPE=120,SHAPEW>D118),1,0)","v":0},{"$f":"IF(AND(SHAPEW>0,SHAPEH>0,OFFSET>0,SHAPE=120,(SHAPEW+SHAPEH)>E118),1,0)","v":0},{"$f":"IF(AND(SHAPEW>0,SHAPEH>0,OFFSET>0,SHAPE=120,((SHAPEW*SHAPEH)/144)>F118),1,0)","v":0},null,null,"Glass Leg Length:",{"$f":"IF(AND(SHAPEW>0,OFFSET>0,SHAPE=120),(((SHAPEW/2)-OFFSET)*TAN(RADIANS(30)))*2,0)","v":0},null,null,null,null,null,null,null,119,{"$f":"IF(AND(SHAPEW>0,SHAPEH>0,SHAPE=119),9,0)","v":0},{"$f":"IF(S119>0,\"Max Height:\",0)","v":0},{"$f":"IF(S119>0,E106,0)","v":0},{"$f":"IF(AND(S119>0,SHAPEH>0,SHAPEH>U119),1,0)","v":0},null,null,null,null,117,"6103","84","72","144","96","228"]
[null,null,{"$f":"MAX(C119:F119)","v":0},{"$f":"IF(AND(SHAPE=B117,C120=1),1,0)","v":0},null,{"$f":"IF(AND(SHAPE=120,SHAPEW>0,SHAPEH>0,SHAPEW<>SHAPEH),\"WIDTH AND HEIGHT MUST BE EQUAL\",IF(AND(SHAPE=120,J120>0,J120<GlassMinW),\"Glass Width is Under Minimum\",IF(AND(SHAPE=120,J121>0,J121<GlassMinH),\"Glass Height is Under Minimum\",\"\")))","v":""},null,null,"Glass Width:",{"$f":"IF(AND(SHAPEW>0,OFFSET>0,SHAPE=120),SHAPEW-(OFFSET*2),0)","v":0},null,null,null,null,null,null,null,119,{"$f":"IF(AND(SHAPEW>0,SHAPEH>0,SHAPE=119),10,0)","v":0},{"$f":"IF(S120>0,\"Max UI:\",0)","v":0},{"$f":"IF(S120>0,F106,0)","v":0},{"$f":"IF(AND(S120>0,F107>0),1,0)","v":0},null,null,null,null,118,"6104","96","72","144","96","240"]
[null,null,null,null,null,null,null,null,"Glass Height:",{"$f":"IF(AND(SHAPEW>0,OFFSET>0,SHAPE=120),J119+(2*(J119*SIN(RADIANS(30)))),0)","v":0},null,null,null,null,null,null,null,120,{"$f":"IF(AND(SHAPEW>0,SHAPE=120),1,0)","v":0},{"$f":"IF(S121>0,\"Frame Height:\",0)","v":0},{"$f":"IF(S121>0,J117,0)","v":0},null,null,null,null,null,119,"6105",60,80,60,80,140]
[null,null,null,null,null,null,null,null,null,null,null,null,null,null,null,null,null,120,{"$f":"IF(AND(SHAPEW>0,SHAPE=120),2,0)","v":0},{"$f":"IF(S122>0,\"Frame Leg:\",0)","v":0},{"$f":"IF(S122>0,J118,0)","v":0},{"$f":"IF(AND(S122>0,C119>0),1,0)","v":0},null,null,null,null,120,"6106",72,80,72,80,152]
[null,null,null,null,null,null,null,null,null,null,null,null,null,null,null,null,null,120,{"$f":"IF(AND(SHAPEW>0,SHAPE=120),3,0)","v":0},{"$f":"IF(S123>0,\"Min Leg:\",0)","v":0},{"$f":"IF(S123>0,C118,0)","v":0},{"$f":"IF(AND(S123>0,C119>0),1,0)","v":0},null,null,null,null,121,"6108",96,80,96,80,176]
[null,null,null,null,null,null,null,null,null,null,null,null,null,null,null,null,null,120,{"$f":"IF(AND(SHAPEW>0,SHAPE=120),4,0)","v":0},{"$f":"IF(S124>0,\"Glass Width:\",0)","v":0},{"$f":"IF(S124>0,J120,0)","v":0},{"$f":"IF(AND(U124>0,U124<GlassMinW),1,0)","v":0},null,null,null,null,122,"6109",108,80,108,80,188]
[null,121,"Min Angle","Max Cut","Max W","Max H","Min Side","Max UI",null,null,null,null,null,null,null,null,null,120,{"$f":"IF(AND(SHAPEW>0,SHAPE=120),5,0)","v":0},{"$f":"IF(S125>0,\"Glass Height:\",0)","v":0},{"$f":"IF(S125>0,J121,0)","v":0},{"$f":"IF(AND(U125>0,U125<GlassMinH),1,0)","v":0},null,null,null,null,123,"6112",144,80,144,80,224]
[null,{"$f":"EXT","v":1},{"$f":"MIN_ANGLE","v":""},{"$f":"CUT_LENGTH","v":""},{"$f":"MAX_W","v":""},{"$f":"MAX_H","v":""},{"$f":"MIN_LEG","v":""},{"$f":"MAX_UI","v":""},null,null,null,null,null,null,null,null,null,120,{"$f":"IF(AND(SHAPEW>0,SHAPE=120),6,0)","v":0},{"$f":"IF(S126>0,\"Glass Leg:\",0)","v":0},{"$f":"IF(S126>0,J119,0)","v":0},null,null,null,null,null,124,"6122",144,80,144,80,224]
[null,null,{"$f":"IF(AND(SHAPEW>0,SHAPE=121,OR(D130<C126,D133<C126)),1,0)","v":0},{"$f":"IF(AND(SHAPEW>0,SHAPEH>0,SHAPE=121,OR(D131>D126,D132>D126,H131>D126,H132>D126)),1,0)","v":0},{"$f":"IF(AND(SHAPEW>0,OFFSET>0,SHAPE=121,SHAPEW>E126),1,0)","v":0},{"$f":"IF(AND(SHAPEH>0,OFFSET>0,SHAPE=121,SHAPEH>F126),1,0)","v":0},{"$f":"IF(AND(SHAPEW>0,DIM_3>0,SHAPE=121,OR(DIM_3<G126,D134<G126)),1,0)","v":0},{"$f":"IF(AND(SHAPEW>0,SHAPEH>0,OFFSET>0,SHAPE=121,(SHAPEW+SHAPEH)>H126),1,0)","v":0},null,null,null,null,null,null,null,null,null,120,{"$f":"IF(AND(SHAPEW>0,SHAPE=120),7,0)","v":0},{"$f":"IF(S127>0,\"Max Width:\",0)","v":0},{"$f":"IF(S127>0,D118,0)","v":0},{"$f":"IF(AND(S127>0,SHAPEW>0,SHAPEW>U127),1,0)","v":0},null,null,null,null,125,"6175",75,80,75,80,155]
[null,null,{"$f":"MAX(C127:H127)","v":0},{"$f":"IF(AND(SHAPE=B125,OR(C128=1,DIM_3>=SHAPEH)),1,0)","v":0},null,{"$f":"IF(AND(SHAPE=121,G130>0,G130<GlassMinW),\"Glass Width is Under Minimum\",IF(AND(SHAPE=121,G131>0,G131<GlassMinH),\"Glass Height is Under Minimum\",\"\"))","v":""},null,null,null,null,null,null,null,null,null,null,null,120,{"$f":"IF(AND(SHAPEW>0,SHAPE=120),8,0)","v":0},{"$f":"IF(S128>0,\"Max UI:\",0)","v":0},{"$f":"IF(S128>0,E118,0)","v":0},{"$f":"IF(AND(S128>0,E119>0),1,0)","v":0},null,null,null,null,126,"8001",16,25.25,52,84,136]
[null,null,null,null,null,null,null,null,null,null,null,null,null,null,null,null,null,121,{"$f":"IF(AND(SHAPEW>0,SHAPEH>0,DIM_3>0,SHAPE=121),1,0)","v":0},{"$f":"IF(S129>0,\"Roof Pitch:\",0)","v":0},{"$f":"IF(S129>0,H130,0)","v":0},{"$f":"IF(AND(S129>0,D130>=90),1,0)","v":0},null,null,null,null,127,"8002",25.25,16.625,84,68,148]
[null,null,"outer peak angle",{"$f":"IF(AND(SHAPEW>0,SHAPEH>0,DIM_3>0,OFFSET>0,SHAPE=121),90-DEGREES(ATAN(((SHAPEW-DIM_3)/2)/(SHAPEH/2))),0)","v":0},null,"Glass Width:",{"$f":"IF(AND(SHAPEW>0,SHAPEH>0,OFFSET>0,DIM_3>0,SHAPE=121),SHAPEW-(2*D131),0)","v":0},{"$f":"IF(AND(SHAPEW>0,SHAPEH>0,OFFSET>0,DIM_3>0,SHAPE=121),ROUND((12*TAN(RADIANS(D130))),1)&\" /12\",0)","v":0},null,null,null,null,null,null,null,null,null,121,{"$f":"IF(AND(SHAPEW>0,SHAPEH>0,DIM_3>0,SHAPE=121),2,0)","v":0},{"$f":"IF(S130>0,\"Horizontal Leg:\",0)","v":0},{"$f":"IF(AND(S130>0,DIM_3>0),DIM_3,0)","v":0},{"$f":"IF(AND(S130>0,DIM_3<G126),1,0)","v":0},null,null,null,null,128,"8003",44.5,16.625,120,68,188]
[null,null,"outer peak Hor. Cut",{"$f":"IF(AND(SHAPEW>0,SHAPEH>0,OFFSET>0,DIM_3>0,SHAPE=121),OFFSET/SIN(RADIANS(D130)),0)","v":0},null,"Glass Height:",{"$f":"IF(AND(SHAPEW>0,SHAPEH>0,OFFSET>0,DIM_3>0,SHAPE=121),SHAPEH-(2*OFFSET),0)","v":0},{"$f":"IF(AND(SHAPEW>0,SHAPEH>0,SHAPE=121,AQ17=3,SHAPE=121),(OFFSET+0.625)/SIN(RADIANS(D130)),0)","v":0},null,null,null,null,null,null,null,null,null,121,{"$f":"IF(AND(SHAPEW>0,SHAPEH>0,DIM_3>0,SHAPE=121),3,0)","v":0},{"$f":"IF(S131>0,\"Slanted Leg:\",0)","v":0},{"$f":"IF(S131>0,D134,0)","v":0},{"$f":"IF(AND(S131>0,D134<G126),1,0)","v":0},null,null,null,null,129,"8005",14,14,72,60,118]
[null,null,"Bottom & Top Cut",{"$f":"IF(AND(SHAPEW>0,SHAPEH>0,OFFSET>0,DIM_3>0,SHAPE=121),OFFSET/(COS(RADIANS(90-D133))),0)","v":0},null,"Glass Dim3:",{"$f":"IF(AND(SHAPEW>0,SHAPEH>0,OFFSET>0,DIM_3>0,SHAPE=121),DIM_3-((SQRT(D132^2-OFFSET^2))*2),0)","v":0},{"$f":"IF(AND(SHAPEW>0,SHAPEH>0,DIM_3>0,SHAPE=121,AQ17=3),(OFFSET+0.625)/(COS(RADIANS(90-D133))),0)","v":0},null,null,null,null,null,null,null,null,null,121,{"$f":"IF(AND(SHAPEW>0,SHAPEH>0,DIM_3>0,SHAPE=121),4,0)","v":0},{"$f":"IF(S132>0,\"Min Leg:\",0)","v":0},{"$f":"IF(S132>0,G126,0)","v":0},{"$f":"IF(AND(S132>0,G127>0),1,0)","v":0},null,null,null,null,130,"8009",35.5,16.625,120,68,184]
[null,null,"Angles at long legs",{"$f":"IF(AND(SHAPEW>0,SHAPEH>0,OFFSET>0,DIM_3>0,SHAPE=121),90-D130/2,0)","v":0},null,"Glass Slant Leg:",{"$f":"IF(AND(SHAPEW>0,SHAPEH>0,OFFSET>0,DIM_3>0,SHAPE=121),SQRT(((G130/2)-(G132/2))^2+(G131/2)^2),0)","v":0},null,null,null,null,null,null,null,null,null,null,121,{"$f":"IF(AND(SHAPEW>0,SHAPEH>0,DIM_3>0,SHAPE=121),5,0)","v":0},{"$f":"IF(S133>0,\"Outer Peak Angle:\",0)","v":0},{"$f":"IF(S133>0,D130,0)","v":0},{"$f":"IF(AND(S133>0,C127>0,D130<C126),1,0)","v":0},null,null,null,null,131,"8014",13,13,96,96,154]
[null,null,"Slanted leg Length",{"$f":"IF(AND(SHAPEW>0,SHAPEH>0,OFFSET>0,DIM_3>0,SHAPE=121),SQRT(((SHAPEW-DIM_3)/2)^2+(SHAPEH/2)^2),0)","v":0},null,null,null,null,null,null,null,null,null,null,null,null,null,121,{"$f":"IF(AND(SHAPEW>0,SHAPEH>0,DIM_3>0,SHAPE=121),6,0)","v":0},{"$f":"IF(S134>0,\"Outer Peak Cut L:\",0)","v":0},{"$f":"IF(S134>0,D131,0)","v":0},{"$f":"IF(AND(S134>0,D127>0,MAX(K126:L126)>D126),1,0)","v":0},null,null,null,null,132,"8051",19,16,48,48,96]
[null,null,null,null,null,null,null,null,null,null,null,null,null,null,null,null,null,121,{"$f":"IF(AND(SHAPEW>0,SHAPEH>0,DIM_3>0,SHAPE=121),7,0)","v":0},{"$f":"IF(S135>0,\"Top & Bott Angles:\",0)","v":0},{"$f":"IF(S135>0,D133,0)","v":0},{"$f":"IF(AND(S135>0,C127>0,D133<C126),1,0)","v":0},null,null,null,null,133,"8052",19,32,48,96,144]
[null,null,null,null,null,null,null,null,null,null,null,null,null,null,null,null,null,121,{"$f":"IF(AND(SHAPEW>0,SHAPEH>0,DIM_3>0,SHAPE=121),8,0)","v":0},{"$f":"IF(S136>0,\"Top & Bott Cut L:\",0)","v":0},{"$f":"IF(S136>0,D132,0)","v":0},{"$f":"IF(AND(S136>0,D127>0,MAX(K127:L127)>D126),1,0)","v":0},null,null,null,null,134,"8053",19,48,48,96,144]
[null,122,"Min Side","Max W","Max UI","Max sq.ft",null,"Leg Length",{"$f":"IF(AND(SHAPEW>0,OFFSET>0,SHAPE=122),((TAN(22.5*(PI()/180)))*SHAPEW/2)*2,0)","v":0},null,null,null,null,null,null,null,null,121,{"$f":"IF(AND(SHAPEW>0,SHAPEH>0,DIM_3>0,SHAPE=121),9,0)","v":0},{"$f":"IF(S137>0,\"Glass Width:\",0)","v":0},{"$f":"IF(S137>0,G130,0)","v":0},{"$f":"IF(AND(U137>0,U137<GlassMinW),1,0)","v":0},null,null,null,null,135,"8054",19,32,48,96,144]
[null,{"$f":"EXT","v":1},{"$f":"MIN_LEG","v":""},{"$f":"MAX_W","v":""},{"$f":"MAX_UI","v":""},{"$f":"MAX_SF","v":""},null,"Frame H:",{"$f":"IF(AND(SHAPEW>0,OFFSET>0,SHAPE=122),SHAPEW,0)","v":0},null,null,null,null,null,null,null,null,121,{"$f":"IF(AND(SHAPEW>0,SHAPEH>0,DIM_3>0,SHAPE=121),10,0)","v":0},{"$f":"IF(S138>0,\"Glass Height:\",0)","v":0},{"$f":"IF(S138>0,G131,0)","v":0},{"$f":"IF(AND(U138>0,U138<GlassMinH),1,0)","v":0},null,null,null,null,136,"8055",19,32,48,96,144]
[null,null,{"$f":"IF(AND(SHAPEW>0,SHAPE=122,I137<C138),1,0)","v":0},{"$f":"IF(AND(SHAPEW>0,OFFSET>0,SHAPE=122,SHAPEW>D138),1,0)","v":0},{"$f":"IF(AND(SHAPEW>0,SHAPEH>0,OFFSET>0,SHAPE=122,(SHAPEW+SHAPEH)>E138),1,0)","v":0},{"$f":"IF(AND(SHAPEW>0,SHAPEH>0,SHAPE=122,((SHAPEW*SHAPEH)/144)>F138),1,0)","v":0},null,"Glass W:",{"$f":"IF(AND(SHAPEW>0,OFFSET>0,SHAPE=122),SHAPEW-(OFFSET*2),0)","v":0},null,null,null,null,null,null,null,null,121,{"$f":"IF(AND(SHAPEW>0,SHAPEH>0,DIM_3>0,SHAPE=121),11,0)","v":0},{"$f":"IF(S139>0,\"Glass Hor. Leg:\",0)","v":0},{"$f":"IF(S139>0,G132,0)","v":0},null,null,null,null,null,137,"8070",13,13,96,96,154]
[null,null,{"$f":"MAX(C139:F139)","v":0},{"$f":"IF(AND(SHAPE=B137,C140=1),1,0)","v":0},null,{"$f":"IF(AND(SHAPE=122,SHAPEW>0,SHAPEH>0,SHAPEW<>SHAPEH),\"WIDTH AND HEIGHT MUST BE EQUAL\",IF(AND(SHAPE=122,I139>0,I139<GlassMinW),\"Glass Width is Under Minimum\",IF(AND(SHAPE=122,I140>0,I140<GlassMinH),\"Glass Height is Under Minimum\",\"\")))","v":""},null,"Glass H:",{"$f":"IF(AND(SHAPEW>0,OFFSET>0,SHAPE=122),SHAPEW-(OFFSET*2),0)","v":0},null,null,null,null,null,null,null,null,121,{"$f":"IF(AND(SHAPEW>0,SHAPEH>0,DIM_3>0,SHAPE=121),12,0)","v":0},{"$f":"IF(S140>0,\"Glass Slanted Leg:\",0)","v":0},{"$f":"IF(S140>0,G133,0)","v":0},null,null,null,null,null,138,"8071",16,19,36,78,114]
[null,null,null,null,null,null,null,"Glass Legs:",{"$f":"IF(AND(SHAPEW>0,OFFSET>0,SHAPE=122),(((SHAPEW/2)-OFFSET)*TAN(RADIANS(22.5)))*2,0)","v":0},null,null,null,null,null,null,null,null,121,{"$f":"IF(AND(SHAPEW>0,SHAPEH>0,DIM_3>0,SHAPE=121),13,0)","v":0},{"$f":"IF(S141>0,\"Max Width:\",0)","v":0},{"$f":"IF(S141>0,E126,0)","v":0},{"$f":"IF(AND(S141>0,SHAPEW>0,SHAPEW>U141),1,0)","v":0},null,null,null,null,139,"8072",32,19,72,78,150]
[null,null,null,null,null,null,null,null,null,null,null,null,null,null,null,null,null,121,{"$f":"IF(AND(SHAPEW>0,SHAPEH>0,DIM_3>0,SHAPE=121),14,0)","v":0},{"$f":"IF(S142>0,\"Max Height:\",0)","v":0},{"$f":"IF(S142>0,F126,0)","v":0},{"$f":"IF(AND(S142>0,SHAPEH>0,SHAPEH>U142),1,0)","v":0},null,null,null,null,140,"8073",64,19,120,78,198]
[null,null,null,null,null,null,null,null,null,null,null,null,null,null,null,null,null,121,{"$f":"IF(AND(SHAPEW>0,SHAPEH>0,DIM_3>0,SHAPE=121),15,0)","v":0},{"$f":"IF(S143>0,\"Max UI:\",0)","v":0},{"$f":"IF(S143>0,H126,0)","v":0},{"$f":"IF(AND(S143>0,H127>0),1,0)","v":0},null,null,null,null,141,"8074",64,19,120,78,198]
[null,null,null,null,null,null,null,null,null,null,null,null,null,null,null,null,null,122,{"$f":"IF(AND(SHAPEW>0,SHAPE=122),1,0)","v":0},{"$f":"IF(S144>0,\"Frame Height:\",0)","v":0},{"$f":"IF(S144>0,I138,0)","v":0},null,null,null,null,null,142,"8075",80,19,120,78,198]
[null,123,"Min Cut","Min Side","Max W","Max UI","Min Angle",null,{"$f":"IF(SHAPEW<=SHAPEH,((TAN(22.5*(PI()/180)))*SHAPEW/2)*2,((TAN(22.5*(PI()/180)))*SHAPEH/2)*2)","v":0},null,null,null,null,null,null,null,null,122,{"$f":"IF(AND(SHAPEW>0,SHAPE=122),2,0)","v":0},{"$f":"IF(S145>0,\"Frame Leg:\",0)","v":0},{"$f":"IF(S145>0,I137,0)","v":0},{"$f":"IF(AND(S145>0,C139>0),1,0)","v":0},null,null,null,null,143,"8079",48,19,108,78,186]
[null,{"$f":"EXT","v":1},{"$f":"CUT_LENGTH","v":""},{"$f":"MIN_LEG","v":""},{"$f":"MAX_W","v":""},{"$f":"MAX_UI","v":""},{"$f":"MIN_ANGLE","v":""},null,{"$f":"I145*SIN(RADIANS(45))","v":0},null,null,null,null,null,null,null,null,122,{"$f":"IF(AND(SHAPEW>0,SHAPE=122),3,0)","v":0},{"$f":"IF(S146>0,\"Min. Leg:\",0)","v":0},{"$f":"IF(S146>0,C138,0)","v":0},{"$f":"IF(AND(S146>0,C139>0),1,0)","v":0},null,null,null,null,144,"8102",48,72,96,96,180]
[null,null,{"$f":"IF(AND(SHAPEW>0,SHAPE=123,OR(F151>C146,F152>C146,L147>C146,L148>C146)),1,0)","v":0},{"$f":"IF(AND(SHAPEW>0,SHAPEH>0,DIM_3>0,SHAPE=123,OR(D149<D146,D150<D146,D151<D146)),1,0)","v":0},{"$f":"IF(AND(SHAPEW>0,OFFSET>0,SHAPE=123,OR(SHAPEW>E146,SHAPEH>E146)),1,0)","v":0},{"$f":"IF(AND(SHAPEW>0,SHAPEH>0,SHAPE=123,OFFSET>0,(SHAPEW+SHAPEH)>F146),1,0)","v":0},{"$f":"IF(AND(SHAPEW>0,SHAPEH>0,DIM_3>0,SHAPE=123,OR(E155<G146,G154<G146)),1,0)","v":0},null,{"$f":"IF(SHAPEH>SHAPEW,SHAPEH-(2*I146),SHAPEW-(2*I146))","v":0},null,null,null,null,null,null,null,null,122,{"$f":"IF(AND(SHAPEW>0,SHAPE=122),4,0)","v":0},{"$f":"IF(S147>0,\"Glass Width:\",0)","v":0},{"$f":"IF(S147>0,I139,0)","v":0},{"$f":"IF(AND(U147>0,U147<GlassMinW),1,0)","v":0},null,null,null,null,145,"8103",84,72,144,96,228]
[null,null,{"$f":"MAX(C147:G147)","v":0},{"$f":"IF(AND(SHAPE=B145,C148=1),1,0)","v":0},null,{"$f":"IF(AND(SHAPE=123,D154>0,D154<GlassMinW),\"Glass Width is Under Minimum\",IF(AND(SHAPE=123,D155>0,D155<GlassMinH),\"Glass Height is Under Minimum\",\"\"))","v":""},null,null,{"$f":"(DIM_3-I147)/2","v":0},null,null,null,null,null,null,null,null,122,{"$f":"IF(AND(SHAPEW>0,SHAPE=122),5,0)","v":0},{"$f":"IF(S148>0,\"Glass Height:\",0)","v":0},{"$f":"IF(S148>0,I140,0)","v":0},{"$f":"IF(AND(U148>0,U148<GlassMinH),1,0)","v":0},null,null,null,null,146,"8104",96,72,144,96,240]
[null,null,"Vertical Leg",{"$f":"IF(AND(SHAPEW>0,SHAPEH>0,OFFSET>0,DIM_3>0,SHAPE=123),IF(SHAPEW<=SHAPEH,DIM_3,((TAN(22.5*(PI()/180)))*SHAPEH/2)*2),0)","v":0},{"$f":"IF(AND(SHAPEW>0,SHAPEH>0,OFFSET>0,DIM_3>0,SHAPE=123),IF(SHAPEW<=SHAPEH,((TAN(22.5*(PI()/180)))*SHAPEW/2)*2,((TAN(22.5*(PI()/180)))*SHAPEH/2)*2),0)","v":0},{"$f":"IF(AND(SHAPEW>0,SHAPEH>0,OFFSET>0,DIM_3>0,SHAPE=123),ROUND((TAN(RADIANS(90-E154))*12),1)&\" /12\",0)","v":0},"Roof Pitch",null,{"$f":"I146-I148","v":0},null,null,null,null,null,null,null,null,122,{"$f":"IF(AND(SHAPEW>0,SHAPE=122),6,0)","v":0},{"$f":"IF(S149>0,\"Glass Leg:\",0)","v":0},{"$f":"IF(S149>0,I141,0)","v":0},null,null,null,null,null,147,"8105",60,80,60,80,140]
[null,null,"Horizontal Leg",{"$f":"IF(AND(SHAPEW>0,SHAPEH>0,OFFSET>0,DIM_3>0,SHAPE=123),IF(SHAPEW<=SHAPEH,((TAN(22.5*(PI()/180)))*SHAPEW/2)*2,DIM_3),0)","v":0},{"$f":"IF(AND(SHAPEW>0,SHAPEH>0,OFFSET>0,DIM_3>0,SHAPE=123),E149*SIN(RADIANS(45)),0)","v":0},{"$f":"IF(AND(SHAPEW>0,SHAPEH>0,OFFSET>0,DIM_3>0,SHAPE=123),D151-(SQRT(F151^2-OFFSET^2))-(SQRT(F152^2-OFFSET^2)),0)","v":0},"Glass Slanted Leg",null,{"$f":"SQRT(I146^2+I149^2)","v":0},null,null,null,null,null,null,null,null,122,{"$f":"IF(AND(SHAPEW>0,SHAPE=122),7,0)","v":0},{"$f":"IF(S150>0,\"Max Width:\",0)","v":0},{"$f":"IF(S150>0,D138,0)","v":0},{"$f":"IF(AND(S150>0,SHAPEW>0,SHAPEW>U150),1,0)","v":0},null,null,null,null,148,"8106",72,80,72,80,152]
[null,null,"Slanted Leg",{"$f":"IF(AND(SHAPEW>0,SHAPEH>0,OFFSET>0,DIM_3>0,SHAPE=123),SQRT(I146^2+I149^2),0)","v":0},{"$f":"IF(AND(SHAPEW>0,SHAPEH>0,OFFSET>0,DIM_3>0,SHAPE=123),IF(SHAPEH>SHAPEW,SHAPEH-(2*E150),SHAPEW-(2*E150)),0)","v":0},{"$f":"IF(AND(SHAPEW>0,SHAPEH>0,OFFSET>0,DIM_3>0,SHAPE=123),IF(SHAPEW>SHAPEH,SQRT(F153^2+CUTOFFSET^2),SQRT(F154^2+CUTOFFSET^2)),0)","v":0},"Cut L @ V & Slant",null,null,null,null,null,null,null,null,null,null,122,{"$f":"IF(AND(SHAPEW>0,SHAPE=122),8,0)","v":0},{"$f":"IF(S151>0,\"Max UI:\",0)","v":0},{"$f":"IF(S151>0,E138,0)","v":0},{"$f":"IF(AND(S151>0,E139>0),1,0)","v":0},null,null,null,null,149,"8108",96,80,96,80,176]
[null,null,"Glass Vert. Leg",{"$f":"IF(AND(SHAPEW>0,SHAPEH>0,OFFSET>0,DIM_3>0,SHAPE=123),IF(SHAPEW>=SHAPEH,D149-(2*F153),D149-(2*F154)),0)","v":0},{"$f":"IF(AND(SHAPEW>0,SHAPEH>0,OFFSET>0,DIM_3>0,SHAPE=123),(DIM_3-E151)/2,0)","v":0},{"$f":"IF(AND(SHAPEW>0,SHAPEH>0,OFFSET>0,DIM_3>0,SHAPE=123),IF(SHAPEH>SHAPEW,SQRT(F153^2+CUTOFFSET^2),SQRT(F154^2+CUTOFFSET^2)),0)","v":0},"Cut L @ H & Slant",null,null,null,null,null,null,null,null,null,null,123,{"$f":"IF(AND(SHAPEW>0,SHAPEH>0,DIM_3>0,SHAPE=123),1,0)","v":0},{"$f":"IF(S152>0,\"Roof Pitch:\",0)","v":0},{"$f":"IF(S152>0,F149,0)","v":0},{"$f":"IF(AND(SHAPEW>0,SHAPEH>0,DIM_3>0,S152>0,I149<=0),1,0)","v":0},null,null,null,null,150,"8109",108,80,108,80,188]
[null,null,"Glass Hor. Leg",{"$f":"IF(AND(SHAPEW>0,SHAPEH>0,OFFSET>0,DIM_3>0,SHAPE=123),IF(SHAPEW>=SHAPEH,D150-(2*F154),D150-(2*F153)),0)","v":0},{"$f":"IF(AND(SHAPEW>0,SHAPEH>0,OFFSET>0,DIM_3>0,SHAPE=123),E150-E152,0)","v":0},{"$f":"IF(AND(SHAPEW>0,SHAPEH>0,OFFSET>0,DIM_3>0,SHAPE=123),OFFSET/TAN(RADIANS(E155)),0)","v":0},{"$f":"IF(AND(SHAPEW>0,SHAPEH>0,OFFSET>0,DIM_3>0,SHAPE=123),90-E154,0)","v":0},null,null,null,null,null,null,null,null,null,null,123,{"$f":"IF(AND(SHAPEW>0,SHAPEH>0,DIM_3>0,SHAPE=123),2,0)","v":0},{"$f":"IF(S153>0,\"Horizontal Leg:\",0)","v":0},{"$f":"IF(S153>0,D150,0)","v":0},{"$f":"IF(AND(SHAPEW>0,SHAPEH>0,DIM_3>0,S153>0,DIM_3<D146),1,0)","v":0},null,null,null,null,151,"8112",144,80,144,80,224]
[null,null,"Glass Width",{"$f":"IF(AND(SHAPEW>0,SHAPEH>0,OFFSET>0,DIM_3>0,SHAPE=123),SHAPEW-(2*OFFSET),0)","v":0},{"$f":"IF(AND(SHAPEW>0,SHAPEH>0,OFFSET>0,DIM_3>0,SHAPE=123),DEGREES(ATAN(E153/E150)),0)","v":0},{"$f":"IF(AND(SHAPEW>0,SHAPEH>0,OFFSET>0,DIM_3>0,SHAPE=123),OFFSET/TAN(RADIANS(G154)),0)","v":0},{"$f":"IF(AND(SHAPEW>0,SHAPEH>0,OFFSET>0,DIM_3>0,SHAPE=123),E154+(G153/2),0)","v":0},null,null,null,null,null,null,null,null,null,null,123,{"$f":"IF(AND(SHAPEW>0,SHAPEH>0,DIM_3>0,SHAPE=123),3,0)","v":0},{"$f":"IF(S154>0,\"Slanted Leg:\",0)","v":0},{"$f":"IF(S154>0,D151,0)","v":0},{"$f":"IF(AND(SHAPEW>0,SHAPEH>0,DIM_3>0,S154>0,D151<D146),1,0)","v":0},null,null,null,null,152,"8122",144,80,144,80,224]
[null,null,"Glass Height",{"$f":"IF(AND(SHAPEW>0,SHAPEH>0,OFFSET>0,DIM_3>0,SHAPE=123),SHAPEH-(2*OFFSET),0)","v":0},{"$f":"IF(AND(SHAPEW>0,SHAPEH>0,OFFSET>0,DIM_3>0,SHAPE=123),90-(E154/2),0)","v":0},null,null,null,null,null,null,null,null,null,null,null,null,123,{"$f":"IF(AND(SHAPEW>0,SHAPEH>0,DIM_3>0,SHAPE=123),4,0)","v":0},{"$f":"IF(S155>0,\"Vertical Leg:\",0)","v":0},{"$f":"IF(S155>0,D149,0)","v":0},{"$f":"IF(AND(SHAPEW>0,SHAPEH>0,DIM_3>0,S155>0,D149<D146),1,0)","v":0},null,null,null,null,153,"8175",75,80,75,80,155]
[null,null,null,null,null,null,null,null,null,null,null,null,null,null,null,null,null,123,{"$f":"IF(AND(SHAPEW>0,SHAPEH>0,DIM_3>0,SHAPE=123),5,0)","v":0},{"$f":"IF(S156>0,\"Vert & Slant Angle:\",0)","v":0},{"$f":"IF(S156>0,E155,0)","v":0},{"$f":"IF(AND(SHAPEW>0,SHAPEH>0,DIM_3>0,S156>0,E155<G146),1,0)","v":0},null,null,null,null,154,"8402",48,72,96,96,192]
[null,null,null,null,null,null,null,null,null,null,null,null,null,null,null,null,null,123,{"$f":"IF(AND(SHAPEW>0,SHAPEH>0,DIM_3>0,SHAPE=123),6,0)","v":0},{"$f":"IF(S157>0,\"Hor & Slant Angle:\",0)","v":0},{"$f":"IF(S157>0,G154,0)","v":0},{"$f":"IF(AND(SHAPEW>0,SHAPEH>0,DIM_3>0,S157>0,G154<G146),1,0)","v":0},null,null,null,null,155,"8403",84,72,144,96,240]
[null,124,"Min Cut","Min Side","Max W","Max UI",null,"Unit Height:",{"$f":"IF(AND(SHAPEW>0,OFFSET>0,SHAPE=124),(SHAPEW*COS(RADIANS(54)))+(SHAPEW*SIN(RADIANS(72))),0)","v":0},null,null,null,null,null,null,null,null,123,{"$f":"IF(AND(SHAPEW>0,SHAPEH>0,DIM_3>0,SHAPE=123),7,0)","v":0},{"$f":"IF(S158>0,\"Vert & Slant Cut L:\",0)","v":0},{"$f":"IF(S158>0,F151,0)","v":0},{"$f":"IF(AND(SHAPEW>0,SHAPEH>0,DIM_3>0,S158>0,F151>C146),1,0)","v":0},null,null,null,null,156,"8404",96,72,144,96,240]
[null,{"$f":"EXT","v":1},{"$f":"CUT_LENGTH","v":""},{"$f":"MIN_LEG","v":""},{"$f":"MAX_W","v":""},{"$f":"MAX_UI","v":""},null,"Cut Length:",{"$f":"IF(AND(SHAPEW>0,OFFSET>0,SHAPE=124),OFFSET/SIN(RADIANS(54)),0)","v":0},{"$f":"IF(AND(SHAPEW>0,OFFSET>0,SHAPE=124),SHAPEW-((SQRT(I159^2-OFFSET^2))*2),0)","v":0},null,null,null,null,null,null,null,123,{"$f":"IF(AND(SHAPEW>0,SHAPEH>0,DIM_3>0,SHAPE=123),8,0)","v":0},{"$f":"IF(S159>0,\"Hor & Slant Cut L:\",0)","v":0},{"$f":"IF(S159>0,F152,0)","v":0},{"$f":"IF(AND(SHAPEW>0,SHAPEH>0,DIM_3>0,S159>0,F152>C146),1,0)","v":0},null,null,null,null,157,"8405",60,80,60,96,156]
[null,null,{"$f":"IF(AND(SHAPEW>0,SHAPE=124,OR(I159>C159,I160>C159)),1,0)","v":0},{"$f":"IF(AND(SHAPEW>0,SHAPE=124,I162<D159),1,0)","v":0},{"$f":"IF(AND(SHAPEW>0,SHAPE=124,OFFSET>0,SHAPEW>E159),1,0)","v":0},{"$f":"IF(AND(SHAPEW>0,SHAPE=124,OFFSET>0,(SHAPEW+I158)>F159),1,0)","v":0},null,"Cut L (SH2201):",{"$f":"IF(AND(SHAPEW>0,OFFSET>0,SHAPE=124),IF(AQ17=3,(OFFSET+0.625)/SIN(RADIANS(54)),0),0)","v":0},{"$f":"J159*COS(RADIANS(72))","v":0},null,null,null,null,null,null,null,123,{"$f":"IF(AND(SHAPEW>0,SHAPEH>0,DIM_3>0,SHAPE=123),9,0)","v":0},{"$f":"IF(S160>0,\"Glass Width:\",0)","v":0},{"$f":"IF(S160>0,D154,0)","v":0},{"$f":"IF(AND(SHAPEW>0,SHAPEH>0,DIM_3>0,U160>0,U160<GlassMinW),1,0)","v":0},null,null,null,null,158,"8406",72,80,72,96,168]
[null,null,{"$f":"MAX(C160:F160)","v":0},{"$f":"IF(AND(SHAPE=B158,C161=1),1,0)","v":0},null,{"$f":"IF(AND(SHAPE=124,I163>0,I163<GlassMinW),\"Glass Width is Under Minimum\",IF(AND(SHAPE=124,I164>0,I164<GlassMinH),\"Glass Height is Under Minimum\",\"\"))","v":""},null,"Glass Height",{"$f":"IF(AND(SHAPEW>0,OFFSET>0,SHAPE=124),I158-(OFFSET+I159),0)","v":0},null,null,null,null,null,null,null,null,123,{"$f":"IF(AND(SHAPEW>0,SHAPEH>0,DIM_3>0,SHAPE=123),10,0)","v":0},{"$f":"IF(S161>0,\"Glass Height:\",0)","v":0},{"$f":"IF(S161>0,D155,0)","v":0},{"$f":"IF(AND(SHAPEW>0,SHAPEH>0,DIM_3>0,U161>0,U161<GlassMinH),1,0)","v":0},null,null,null,null,159,"8408",96,80,96,96,190]
[null,null,null,null,null,null,null,"Leg Length",{"$f":"IF(AND(SHAPEW>0,OFFSET>0,SHAPE=124),SHAPEW,0)","v":0},null,null,null,null,null,null,null,null,123,{"$f":"IF(AND(SHAPEW>0,SHAPEH>0,DIM_3>0,SHAPE=123),11,0)","v":0},{"$f":"IF(S162>0,\"Glass Hor. Leg:\",0)","v":0},{"$f":"IF(S162>0,D153,0)","v":0},{"$f":"IF(AND(SHAPEW>0,SHAPEH>0,DIM_3>0,U162<6),1,0)","v":0},null,null,null,null,160,"8409",108,80,108,96,204]
[null,null,null,null,null,null,null,"Glass Width:",{"$f":"J159+(2*J160)","v":0},null,null,null,null,null,null,null,null,123,{"$f":"IF(AND(SHAPEW>0,SHAPEH>0,DIM_3>0,SHAPE=123),12,0)","v":0},{"$f":"IF(S163>0,\"Glass Vert. Leg:\",0)","v":0},{"$f":"IF(S163>0,D152,0)","v":0},{"$f":"IF(AND(SHAPEW>0,SHAPEH>0,DIM_3>0,U163<6),1,0)","v":0},null,null,null,null,161,"8412",144,80,144,96,240]
[null,null,null,null,null,null,null,"Glass Height:",{"$f":"IF(AND(SHAPEW>0,OFFSET>0,SHAPE=124),I158-OFFSET-I159,0)","v":0},null,null,null,null,null,null,null,null,123,{"$f":"IF(AND(SHAPEW>0,SHAPEH>0,DIM_3>0,SHAPE=123),13,0)","v":0},{"$f":"IF(S164>0,\"Max Width:\",0)","v":0},{"$f":"IF(S164>0,E146,0)","v":0},{"$f":"IF(AND(S164>0,SHAPEW>0,SHAPEW>U164),1,0)","v":0},null,null,null,null,162,"8422",144,80,144,96,240]
[null,null,null,null,null,null,null,"Glass Leg:",{"$f":"IF(AND(SHAPEW>0,OFFSET>0,SHAPE=124),I162-((SQRT(I159^2-OFFSET^2))*2),0)","v":0},null,null,null,null,null,null,null,null,123,{"$f":"IF(AND(SHAPEW>0,SHAPEH>0,DIM_3>0,SHAPE=123),14,0)","v":0},{"$f":"IF(S165>0,\"Max Height:\",0)","v":0},{"$f":"IF(S165>0,E146,0)","v":0},{"$f":"IF(AND(S165>0,SHAPEH>0,SHAPEH>U165),1,0)","v":0},null,null,null,null,163,"8475",75,80,75,80,155]
[null,null,null,null,null,null,null,null,null,null,null,null,null,null,null,null,null,123,{"$f":"IF(AND(SHAPEW>0,SHAPEH>0,DIM_3>0,SHAPE=123),15,0)","v":0},{"$f":"IF(S166>0,\"Max UI:\",0)","v":0},{"$f":"IF(S166>0,F146,0)","v":0},{"$f":"IF(AND(S166>0,F147>0),1,0)","v":0},null,null,null,null,164,"9001",16,26,52,84,136]
[null,null,null,null,null,null,null,null,null,null,null,null,null,null,null,null,null,124,{"$f":"IF(AND(SHAPEW>0,SHAPE=124),1,0)","v":0},{"$f":"IF(S167>0,\"Frame Height:\",0)","v":0},{"$f":"IF(S167>0,I158,0)","v":0},null,null,null,null,null,165,"9002",25.25,16.625,84,68,148]
[null,125,"Min Side","Min Cut","Max W","Max H","Max UI","Min Angle",null,null,null,null,null,null,null,null,null,124,{"$f":"IF(AND(SHAPEW>0,SHAPE=124),2,0)","v":0},{"$f":"IF(S168>0,\"Frame Leg:\",0)","v":0},{"$f":"IF(S168>0,I162,0)","v":0},{"$f":"IF(AND(S168>0,D160>0),1,0)","v":0},null,null,null,null,166,"9003",44.5,16.625,120,68,188]
[null,{"$f":"EXT","v":1},{"$f":"MIN_LEG","v":""},{"$f":"CUT_LENGTH","v":""},{"$f":"MAX_W","v":""},{"$f":"MAX_H","v":""},{"$f":"MAX_UI","v":""},{"$f":"MIN_ANGLE","v":""},null,null,null,null,null,null,null,null,null,124,{"$f":"IF(AND(SHAPEW>0,SHAPE=124),3,0)","v":0},{"$f":"IF(S169>0,\"Cut Length:\",0)","v":0},{"$f":"IF(S169>0,MAX(I159:I160),0)","v":0},{"$f":"IF(AND(S169>0,C160>0),1,0)","v":0},null,null,null,null,167,"9005",14,14,72,60,118]
[null,null,{"$f":"IF(AND(SHAPEW>0,SHAPEH>0,DIM_3>0,DIM_4>0,OFFSET>0,SHAPE=125,OR(SHAPEW<C169,SHAPEH<C169,DIM_3<C169,DIM_4<C169,G175<C169)),1,0)","v":0},{"$f":"IF(AND(SHAPEW>0,SHAPEH>0,DIM_3>0,DIM_4>0,OFFSET>0,SHAPE=125,OR(D174>D169,D175>D169,D176>D169,K169>D169,K170>D169,K171>D169)),1,0)","v":0},{"$f":"IF(AND(SHAPEW>0,OFFSET>0,SHAPE=125,SHAPEW>E169),1,0)","v":0},{"$f":"IF(AND(SHAPEW>0,OFFSET>0,SHAPE=125,SHAPEH>F169),1,0)","v":0},{"$f":"IF(AND(SHAPEW>0,SHAPEH>0,OFFSET>0,SHAPE=125,(SHAPEW+SHAPEH)>G169),1,0)","v":0},{"$f":"IF(AND(SHAPEW>0,SHAPEH>0,DIM_3>0,DIM_4>0,SHAPE=125,OR(G174<H169,D173<H169)),1,0)","v":0},null,null,null,null,null,null,null,null,null,124,{"$f":"IF(AND(SHAPEW>0,SHAPE=124),4,0)","v":0},{"$f":"IF(S170>0,\"Glass Width:\",0)","v":0},{"$f":"IF(S170>0,I163,0)","v":0},{"$f":"IF(AND(U170>0,U170<GlassMinW),1,0)","v":0},null,null,null,null,168,"9009",35.5,16.625,120,68,184]
[null,null,{"$f":"MAX(C170:H170)","v":0},{"$f":"IF(AND(SHAPE=B168,C171=1),1,0)","v":0},null,null,{"$f":"IF(AND(SHAPE=125,G176>0,G176<GlassMinW),\"Glass Width is Under Minimum\",IF(AND(SHAPE=125,G177>0,G177<GlassMinH),\"Glass Height is Under Minimum\",\"\"))","v":""},null,null,null,null,null,null,null,null,null,null,124,{"$f":"IF(AND(SHAPEW>0,SHAPE=124),5,0)","v":0},{"$f":"IF(S171>0,\"Glass Height:\",0)","v":0},{"$f":"IF(S171>0,I164,0)","v":0},{"$f":"IF(AND(U171>0,U171<GlassMinH),1,0)","v":0},null,null,null,null,169,"9014",13,13,96,96,154]
[null,null,null,null,null,null,null,null,null,null,null,null,null,null,null,null,null,124,{"$f":"IF(AND(SHAPEW>0,SHAPE=124),6,0)","v":0},{"$f":"IF(S172>0,\"Glass Leg:\",0)","v":0},{"$f":"IF(S172>0,I165,0)","v":0},null,null,null,null,null,170,"9051",19,16,48,48,96]
[null,null,"Roof Pitch:",{"$f":"IF(AND(SHAPEH>0,SHAPEW>0,DIM_3>0,DIM_4>0,OFFSET>0,SHAPE=125),90-DEGREES(ATAN((SHAPEH-DIM_3)/(SHAPEW-DIM_4))),0)","v":0},null,"Glass Dim4:",{"$f":"IF(AND(SHAPEH>0,SHAPEW>0,DIM_3>0,DIM_4>0,OFFSET>0,SHAPE=125),DIM_4-OFFSET-(SQRT(D174^2-OFFSET^2)),0)","v":0},{"$f":"IF(AND(SHAPEH>0,SHAPEW>0,DIM_3>0,DIM_4>0,OFFSET>0,SHAPE=125),ROUND((12*((SHAPEH-DIM_3)/(SHAPEW-DIM_4))),1)&\" / 12\",0)","v":0},null,null,null,null,null,null,null,null,null,124,{"$f":"IF(AND(SHAPEW>0,SHAPE=124),7,0)","v":0},{"$f":"IF(S173>0,\"Max Width:\",0)","v":0},{"$f":"IF(S173>0,E159,0)","v":0},{"$f":"IF(AND(S173>0,SHAPEW>0,SHAPEW>U173),1,0)","v":0},null,null,null,null,171,"9052",19,32,48,96,144]
[null,null,"Peak & Slant Cut:",{"$f":"IF(AND(SHAPEH>0,SHAPEW>0,DIM_3>0,DIM_4>0,OFFSET>0,SHAPE=125),CUTOFFSET/COS(RADIANS((90-D173)/2)),0)","v":0},null,"Angle @ Vert & Slant:",{"$f":"IF(AND(SHAPEH>0,SHAPEW>0,DIM_3>0,DIM_4>0,OFFSET>0,SHAPE=125),DEGREES(ASIN(CUTOFFSET/D175)),0)","v":0},null,null,null,null,null,null,null,null,null,null,124,{"$f":"IF(AND(SHAPEW>0,SHAPE=124),8,0)","v":0},{"$f":"IF(S174>0,\"Max UI:\",0)","v":0},{"$f":"IF(S174>0,F159,0)","v":0},{"$f":"IF(AND(S174>0,F160>0),1,0)","v":0},null,null,null,null,172,"9053",19,48,48,96,144]
[null,null,"Vert & Slant Cut:",{"$f":"IF(AND(SHAPEH>0,SHAPEW>0,DIM_3>0,DIM_4>0,OFFSET>0,SHAPE=125),CUTOFFSET/COS(RADIANS((D173/2))),0)","v":0},null,"Slanted Leg:",{"$f":"IF(AND(SHAPEH>0,SHAPEW>0,DIM_3>0,DIM_4>0,OFFSET>0,SHAPE=125),SQRT((SHAPEW-DIM_4)^2+(SHAPEH-DIM_3)^2),0)","v":0},null,null,null,null,null,null,null,null,null,null,125,{"$f":"IF(AND(SHAPEW>0,SHAPEH>0,DIM_3>0,DIM_4>0,SHAPE=125),1,0)","v":0},{"$f":"IF(S175>0,\"Roof Pitch:\",0)","v":0},{"$f":"IF(S175>0,H173,0)","v":0},null,null,null,null,null,173,"9054",19,32,48,96,144]
[null,null,"All 45O Cuts:",{"$f":"IF(AND(SHAPEH>0,SHAPEW>0,DIM_3>0,DIM_4>0,OFFSET>0,SHAPE=125),CUTOFFSET/COS(RADIANS(45)),0)","v":0},null,"Glass Width:",{"$f":"IF(AND(SHAPEH>0,SHAPEW>0,DIM_3>0,DIM_4>0,OFFSET>0,SHAPE=125),SHAPEW-(OFFSET*2),0)","v":0},null,null,null,null,null,null,null,null,null,null,125,{"$f":"IF(AND(SHAPEW>0,SHAPEH>0,DIM_3>0,DIM_4>0,SHAPE=125),2,0)","v":0},{"$f":"IF(S176>0,\"Horizontal Leg:\",0)","v":0},{"$f":"IF(AND(S176>0,DIM_4>0),DIM_4,0)","v":0},{"$f":"IF(AND(S176>0,DIM_4>0,DIM_4<C169),1,0)","v":0},null,null,null,null,174,"9055",19,32,48,96,144]
[null,null,"Glass Dim3:",{"$f":"IF(AND(SHAPEH>0,SHAPEW>0,DIM_3>0,DIM_4>0,OFFSET>0,SHAPE=125),DIM_3-OFFSET-(SQRT(D175^2-OFFSET^2)),0)","v":0},null,"Glass Height:",{"$f":"IF(AND(SHAPEH>0,SHAPEW>0,DIM_3>0,DIM_4>0,OFFSET>0,SHAPE=125),SHAPEH-(OFFSET*2),0)","v":0},null,null,null,null,null,null,null,null,null,null,125,{"$f":"IF(AND(SHAPEW>0,SHAPEH>0,DIM_3>0,DIM_4>0,SHAPE=125),3,0)","v":0},{"$f":"IF(S177>0,\"Slanted Leg:\",0)","v":0},{"$f":"IF(S177>0,G175,0)","v":0},{"$f":"IF(AND(S177>0,DIM_3>0,DIM_4>0,G175<C169),1,0)","v":0},null,null,null,null,175,"9070",13,13,96,96,154]
[null,null,null,null,null,null,null,null,null,null,null,null,null,null,null,null,null,125,{"$f":"IF(AND(SHAPEW>0,SHAPEH>0,DIM_3>0,DIM_4>0,SHAPE=125),4,0)","v":0},{"$f":"IF(S178>0,\"Vertical Leg:\",0)","v":0},{"$f":"IF(AND(S178>0,DIM_3>0),DIM_3,0)","v":0},{"$f":"IF(AND(S178>0,DIM_3>0,DIM_3<C169),1,0)","v":0},null,null,null,null,176,"9071",16,19,36,78,114]
[null,null,null,null,null,null,null,null,null,null,null,null,null,null,null,null,null,125,{"$f":"IF(AND(SHAPEW>0,SHAPEH>0,DIM_3>0,DIM_4>0,SHAPE=125),5,0)","v":0},{"$f":"IF(S179>0,\"Vert & Slant Angle:\",0)","v":0},{"$f":"IF(S179>0,G174,0)","v":0},{"$f":"IF(AND(S179>0,DIM_3>0,DIM_4>0,SHAPEW>0,SHAPEH>0,G174<H169),1,0)","v":0},null,null,null,null,177,"9072",32,19,72,78,150]
[null,126,"Min Side","Min Cut","Max W","Max H","Max UI","Min Angle",null,null,null,null,null,null,null,null,null,125,{"$f":"IF(AND(SHAPEW>0,SHAPEH>0,DIM_3>0,DIM_4>0,SHAPE=125),6,0)","v":0},{"$f":"IF(S180>0,\"Hor & Slant Angle:\",0)","v":0},{"$f":"IF(S180>0,D173,0)","v":0},{"$f":"IF(AND(S180>0,DIM_3>0,DIM_4>0,SHAPEW>0,SHAPEH>0,D173<H169),1,0)","v":0},null,null,null,null,178,"9073",64,19,120,78,198]
[null,{"$f":"EXT","v":1},{"$f":"MIN_LEG","v":""},{"$f":"CUT_LENGTH","v":""},{"$f":"MAX_W","v":""},{"$f":"MAX_H","v":""},{"$f":"MAX_UI","v":""},{"$f":"MIN_ANGLE","v":""},null,null,null,null,null,null,null,null,null,125,{"$f":"IF(AND(SHAPEW>0,SHAPEH>0,DIM_3>0,DIM_4>0,SHAPE=125),7,0)","v":0},{"$f":"IF(S181>0,\"Vert & Slant Cut L:\",0)","v":0},{"$f":"IF(S181>0,D175,0)","v":0},{"$f":"IF(AND(S181>0,D175>D169),1,0)","v":0},null,null,null,null,179,"9074",64,19,120,78,198]
[null,null,{"$f":"IF(AND(SHAPEW>0,SHAPEH>0,DIM_3>0,SHAPE=126,OR(SHAPEW<C181,SHAPEH<C181,DIM_3<C181,G187<C181)),1,0)","v":0},{"$f":"IF(AND(SHAPEW>0,SHAPEH>0,DIM_3>0,SHAPE=126,OR(D187>D181,D188>D181,D189>D181)),1,0)","v":0},{"$f":"IF(AND(SHAPEW>0,SHAPE=126,OFFSET>0,SHAPEW>E181),1,0)","v":0},{"$f":"IF(AND(SHAPEW>0,SHAPE=126,OFFSET>0,SHAPEH>F181),1,0)","v":0},{"$f":"IF(AND(SHAPEW>0,SHAPEH>0,SHAPE=126,OFFSET>0,(SHAPEW+SHAPEH)>G181),1,0)","v":0},{"$f":"IF(AND(SHAPEW>0,SHAPEH>0,DIM_3>0,SHAPE=126,D185<H181,G189<H181),1,0)","v":0},null,null,null,null,null,null,null,null,null,125,{"$f":"IF(AND(SHAPEW>0,SHAPEH>0,DIM_3>0,DIM_4>0,SHAPE=125),8,0)","v":0},{"$f":"IF(S182>0,\"Hor & Slant Cut L:\",0)","v":0},{"$f":"IF(S182>0,D174,0)","v":0},{"$f":"IF(AND(S182>0,D174>D169),1,0)","v":0},null,null,null,null,180,"9075",80,19,120,78,198]
[null,null,{"$f":"MAX(C182:H182)","v":0},{"$f":"IF(AND(SHAPE=126,C183=1),1,0)","v":0},null,null,{"$f":"IF(AND(SHAPE=126,G188>0,G188<GlassMinW),\"Glass Width is Under Minimum\",IF(AND(SHAPE=126,G185>0,G185<GlassMinH),\"Glass Height is Under Minimum\",\"\"))","v":""},null,null,null,null,null,null,null,null,null,null,125,{"$f":"IF(AND(SHAPEW>0,SHAPEH>0,DIM_3>0,DIM_4>0,SHAPE=125),9,0)","v":0},{"$f":"IF(S183>0,\"Glass Width:\",0)","v":0},{"$f":"IF(S183>0,G176,0)","v":0},{"$f":"IF(AND(U183>0,U183<GlassMinW),1,0)","v":0},null,null,null,null,181,"9079",48,19,108,78,186]
[null,null,null,null,null,null,null,null,null,null,null,null,null,null,null,null,null,125,{"$f":"IF(AND(SHAPEW>0,SHAPEH>0,DIM_3>0,DIM_4>0,SHAPE=125),10,0)","v":0},{"$f":"IF(S184>0,\"Glass Height:\",0)","v":0},{"$f":"IF(S184>0,G177,0)","v":0},{"$f":"IF(AND(U184>0,U184<GlassMinH),1,0)","v":0},null,null,null,null,182,"9102",48,72,96,96,180]
[null,null,"Roof Pitch:",{"$f":"IF(AND(SHAPEW>0,SHAPEH>0,DIM_3>0,OFFSET>0,SHAPE=126),90-DEGREES(ATAN((SHAPEH-DIM_3)/(SHAPEW/2))),0)","v":0},null,"Glass Height:",{"$f":"IF(AND(SHAPEW>0,SHAPEH>0,DIM_3>0,OFFSET>0,SHAPE=126),SHAPEH-OFFSET-D186,0)","v":0},{"$f":"IF(AND(SHAPEH>0,DIM_3>0,SHAPEW>0,OFFSET>0,SHAPE=126),ROUND((12*((SHAPEH-DIM_3)/(SHAPEW/2))),1)&\" /12\",0)","v":0},null,null,null,null,null,null,null,null,null,125,{"$f":"IF(AND(SHAPEW>0,SHAPEH>0,DIM_3>0,DIM_4>0,SHAPE=125),11,0)","v":0},{"$f":"IF(S185>0,\"Glass Hor. Leg:\",0)","v":0},{"$f":"IF(S185>0,G173,0)","v":0},null,null,null,null,null,183,"9103",84,72,144,96,228]
[null,null,"Cut L @ Peak:",{"$f":"IF(AND(SHAPEW>0,SHAPEH>0,OFFSET>0,DIM_3>0,SHAPE=126),OFFSET/(SIN(RADIANS(D185))),0)","v":0},null,"Glass Leg Height:",{"$f":"IF(AND(SHAPEW>0,SHAPEH>0,DIM_3>0,OFFSET>0,SHAPE=126),DIM_3-OFFSET-(SQRT(D188^2-OFFSET^2)),0)","v":0},null,null,null,null,null,null,null,null,null,null,125,{"$f":"IF(AND(SHAPEW>0,SHAPEH>0,DIM_3>0,DIM_4>0,SHAPE=125),12,0)","v":0},{"$f":"IF(S186>0,\"Glass Vert. Leg:\",0)","v":0},{"$f":"IF(S186>0,D177,0)","v":0},null,null,null,null,null,184,"9104",96,72,144,96,240]
[null,null,"Cut L @ Peak:",{"$f":"IF(AND(SHAPEW>0,SHAPEH>0,OFFSET>0,DIM_3>0,SHAPE=126),CUTOFFSET/(SIN(RADIANS(D185))),0)","v":0},null,"Slanted Leg:",{"$f":"IF(AND(SHAPEW>0,SHAPEH>0,DIM_3>0,OFFSET>0,SHAPE=126),SQRT((SHAPEH-DIM_3)^2+(SHAPEW/2)^2),0)","v":0},null,null,null,null,null,null,null,null,null,null,125,{"$f":"IF(AND(SHAPEW>0,SHAPEH>0,DIM_3>0,DIM_4>0,SHAPE=125),13,0)","v":0},{"$f":"IF(S187>0,\"Max Width:\",0)","v":0},{"$f":"IF(S187>0,E169,0)","v":0},{"$f":"IF(AND(S187>0,SHAPEW>0,SHAPEW>U187),1,0)","v":0},null,null,null,null,185,"9105",60,80,60,80,140]
[null,null,"Cut L @ Vert & Slant:",{"$f":"IF(AND(SHAPEW>0,SHAPEH>0,DIM_3>0,OFFSET>0,SHAPE=126),CUTOFFSET/SIN(RADIANS((180-D185)/2)),0)","v":0},null,"Glass Width:",{"$f":"IF(AND(SHAPEW>0,SHAPEH>0,DIM_3>0,OFFSET>0,SHAPE=126),SHAPEW-(OFFSET*2),0)","v":0},null,null,null,null,null,null,null,null,null,null,125,{"$f":"IF(AND(SHAPEW>0,SHAPEH>0,DIM_3>0,DIM_4>0,SHAPE=125),14,0)","v":0},{"$f":"IF(S188>0,\"Max Height:\",0)","v":0},{"$f":"IF(S188>0,F169,0)","v":0},{"$f":"IF(AND(S188>0,SHAPEH>0,SHAPEH>U188),1,0)","v":0},null,null,null,null,186,"9106",72,80,72,80,152]
[null,null,"All 45O Cuts:",{"$f":"IF(AND(SHAPEW>0,SHAPEH>0,DIM_3>0,OFFSET>0,SHAPE=126),CUTOFFSET/COS(RADIANS(45)),0)","v":0},null,"Angle @ Leg & Slant",{"$f":"IF(AND(SHAPEW>0,SHAPEH>0,DIM_3>0,OFFSET>0,SHAPE=126),(180-D185)/2,0)","v":0},null,null,null,null,null,null,null,null,null,null,125,{"$f":"IF(AND(SHAPEW>0,SHAPEH>0,DIM_3>0,DIM_4>0,SHAPE=125),15,0)","v":0},{"$f":"IF(S189>0,\"Max UI:\",0)","v":0},{"$f":"IF(S189>0,G169,0)","v":0},{"$f":"IF(AND(S189>0,G170>0),1,0)","v":0},null,null,null,null,187,"9108",96,80,96,80,176]
[null,null,null,null,null,null,null,null,null,null,null,null,null,null,null,null,null,126,{"$f":"IF(AND(SHAPEW>0,SHAPEH>0,DIM_3>0,SHAPE=126),1,0)","v":0},{"$f":"IF(S190>0,\"Roof Pitch:\",0)","v":0},{"$f":"IF(S190>0,H185,0)","v":0},null,null,null,null,null,188,"9109",108,80,108,80,188]
[null,null,null,null,null,null,null,null,null,null,null,null,null,null,null,null,null,126,{"$f":"IF(AND(SHAPEW>0,SHAPEH>0,DIM_3>0,SHAPE=126),2,0)","v":0},{"$f":"IF(S191>0,\"Slanted Leg:\",0)","v":0},{"$f":"IF(S191>0,G187,0)","v":0},{"$f":"IF(AND(S191>0,SHAPEW>0,SHAPEH>0,DIM_3>0,G187<C181),1,0)","v":0},null,null,null,null,189,"9112",144,80,144,80,224]
[null,127,"Min R","Max W","Max H","Max UI","Cut L","Min W",null,null,null,null,null,null,null,null,null,126,{"$f":"IF(AND(SHAPEW>0,SHAPEH>0,DIM_3>0,SHAPE=126),3,0)","v":0},{"$f":"IF(S192>0,\"Vertical Leg:\",0)","v":0},{"$f":"IF(AND(S192>0,DIM_3>0),DIM_3,0)","v":0},{"$f":"IF(AND(S192>0,SHAPEW>0,SHAPEH>0,DIM_3>0,DIM_3<C181),1,0)","v":0},null,null,null,null,190,"9122",144,80,144,80,224]
[null,{"$f":"EXT","v":1},{"$f":"MIN_R","v":""},{"$f":"MAX_W","v":""},{"$f":"MAX_H","v":""},{"$f":"MAX_UI","v":""},{"$f":"CUT_LENGTH","v":""},18,null,null,null,null,null,null,null,null,null,126,{"$f":"IF(AND(SHAPEW>0,SHAPEH>0,DIM_3>0,SHAPE=126),4,0)","v":0},{"$f":"IF(S193>0,\"Leg & Slant Angle:\",0)","v":0},{"$f":"IF(S193>0,G189,0)","v":0},{"$f":"IF(AND(S193>0,SHAPEW>0,SHAPEH>0,DIM_3>0,G189<H181),1,0)","v":0},null,null,null,null,191,"9175",75,80,75,80,155]
[null,null,{"$f":"IF(AND(SHAPEW>0,SHAPE=127,D197<C193),1,0)","v":0},{"$f":"IF(AND(SHAPEW>0,SHAPE=127,OFFSET>0,SHAPEW>D193),1,0)","v":0},{"$f":"IF(AND(SHAPEH>0,SHAPE=127,OFFSET>0,SHAPEH>E193),1,0)","v":0},{"$f":"IF(AND(SHAPEW>0,SHAPEH>0,SHAPE=127,OFFSET>0,(SHAPEW+SHAPEH)>F193),1,0)","v":0},{"$f":"IF(AND(SHAPEW>0,SHAPEH>0,SHAPE=127,OR(G200>G193,G201>G193)),1,0)","v":0},{"$f":"IF(AND(SHAPEW>0,SHAPEH>0,SHAPE=127,OFFSET>0,SHAPEW<H193),1,0)","v":0},null,null,null,null,null,null,null,null,null,126,{"$f":"IF(AND(SHAPEW>0,SHAPEH>0,DIM_3>0,SHAPE=126),5,0)","v":0},{"$f":"IF(S194>0,\"Leg & Slant Cut L:\",0)","v":0},{"$f":"IF(S194>0,D188,0)","v":0},{"$f":"IF(AND(S194>0,U194>D181),1,0)","v":0},null,null,null,null,192,"9402",48,72,96,96,192]
[null,null,{"$f":"MAX(C194:H194)","v":0},{"$f":"IF(AND(SHAPE=B192,C195=1),1,0)","v":0},{"$f":"IF(AND(SHAPEW>0,SHAPEH>0,SHAPE=127,SHAPEH<=(SHAPEW/2)),1,0)","v":0},{"$f":"IF(AND(SHAPE=127,E195=1),\"FRAME HEIGHT MUST BE GREATER THAN 1/2 THE WIDTH\",IF(AND(SHAPE=127,SHAPEW>0,C194>0),\"RADIUS MUST BE GREATER THAN \"&C193,IF(AND(SHAPE=127,D199>0,D199<GlassMinW),\"Glass Width is Under Minimum\",IF(AND(SHAPE=127,D200>0,D200<GlassMinH),\"Glass Height is Under Minimum\",\"\"))))","v":""},null,null,null,null,null,null,null,null,null,null,null,126,{"$f":"IF(AND(SHAPEW>0,SHAPEH>0,DIM_3>0,SHAPE=126),6,0)","v":0},{"$f":"IF(S195>0,\"Peak Cut Length:\",0)","v":0},{"$f":"IF(S195>0,D187,0)","v":0},{"$f":"IF(AND(S195>0,U195>D181),1,0)","v":0},null,null,null,null,193,"9403",84,72,144,96,240]
[null,null,null,null,null,null,null,null,null,null,null,null,null,null,null,null,null,126,{"$f":"IF(AND(SHAPEW>0,SHAPEH>0,DIM_3>0,SHAPE=126),7,0)","v":0},{"$f":"IF(S196>0,\"Corner Cut L:\",0)","v":0},{"$f":"IF(S196>0,MAX(D189,K183),0)","v":0},{"$f":"IF(AND(S196>0,U196>D181),1,0)","v":0},null,null,null,null,194,"9404",96,72,144,96,240]
[null,null,"Frame Radius:",{"$f":"IF(AND(SHAPEW>0,SHAPEH>0,OFFSET>0,SHAPE=127),((SHAPEH)^2+(SHAPEW/2)^2)/(2*(SHAPEW/2)),0)","v":0},null,"d",{"$f":"IF(AND(SHAPEW>0,SHAPEH>0,OFFSET>0,SHAPE=127),D198*COS(D201/2),0)","v":0},{"$f":"IF(AND(SHAPEW>0,SHAPEH>0,OFFSET>0,SHAPE=127),D197-CUTOFFSET,0)","v":0},{"$f":"IF(AND(SHAPEW>0,SHAPEH>0,OFFSET>0,SHAPE=127),H197*COS(H200/2),0)","v":0},null,null,null,null,null,null,null,null,126,{"$f":"IF(AND(SHAPEW>0,SHAPEH>0,DIM_3>0,SHAPE=126),8,0)","v":0},{"$f":"IF(S197>0,\"Glass Width:\",0)","v":0},{"$f":"IF(S197>0,G188,0)","v":0},{"$f":"IF(AND(U197>0,U197<GlassMinW),1,0)","v":0},null,null,null,null,195,"9405",60,80,60,96,156]
[null,null,"Glass Radius:",{"$f":"IF(AND(SHAPEW>0,SHAPEH>0,OFFSET>0,SHAPE=127),D197-OFFSET,0)","v":0},null,"h",{"$f":"IF(AND(SHAPEW>0,SHAPEH>0,OFFSET>0,SHAPE=127),D198-G197,0)","v":0},{"$f":"IF(AND(SHAPEW>0,SHAPEH>0,OFFSET>0,SHAPE=127),(((SHAPEW/2)-((CUTOFFSET*2)+I198))*2)+(CUTOFFSET*2),0)","v":0},{"$f":"IF(AND(SHAPEW>0,SHAPEH>0,OFFSET>0,SHAPE=127),H197-I197,0)","v":0},null,null,null,null,null,null,null,null,126,{"$f":"IF(AND(SHAPEW>0,SHAPEH>0,DIM_3>0,SHAPE=126),9,0)","v":0},{"$f":"IF(S198>0,\"Glass Height:\",0)","v":0},{"$f":"IF(S198>0,G185,0)","v":0},{"$f":"IF(AND(U198>0,U198<GlassMinH),1,0)","v":0},null,null,null,null,196,"9406",72,80,72,96,168]
[null,null,"Glass Width:",{"$f":"IF(AND(SHAPEW>0,SHAPEH>0,OFFSET>0,SHAPE=127),(((SHAPEW/2)-((OFFSET*2)+G198))*2)+(OFFSET*2),0)","v":0},null,"h_Glass",{"$f":"IF(AND(SHAPEW>0,SHAPEH>0,OFFSET>0,SHAPE=127),((SHAPEW/2)-((OFFSET*2)+G198)+OFFSET+G198),0)","v":0},{"$f":"IF(AND(SHAPEW>0,SHAPEH>0,OFFSET>0,SHAPE=127),((SQRT(I199*((2*H197)-I199))))-CUTOFFSET,0)","v":0},{"$f":"IF(AND(SHAPEW>0,SHAPEH>0,OFFSET>0,SHAPE=127),((SHAPEW/2)-((CUTOFFSET*2)+I198)+CUTOFFSET+I198),0)","v":0},null,null,null,null,null,null,null,null,126,{"$f":"IF(AND(SHAPEW>0,SHAPEH>0,DIM_3>0,SHAPE=126),10,0)","v":0},{"$f":"IF(S199>0,\"Glass Leg:\",0)","v":0},{"$f":"IF(S199>0,G186,0)","v":0},null,null,null,null,null,197,"9408",96,80,96,96,190]
[null,null,"Glass Height:",{"$f":"IF(AND(SHAPEW>0,SHAPEH>0,OFFSET>0,SHAPE=127),((SQRT(G199*((2*D198)-G199))))-OFFSET,0)","v":0},null,"Cut @ Peak:",{"$f":"IF(AND(SHAPEW>0,SHAPEH>0,OFFSET>0,SHAPE=127),SHAPEH-CUTOFFSET-H199,0)","v":0},{"$f":"IF(AND(SHAPEW>0,SHAPEH>0,OFFSET>0,SHAPE=127),2*(ASIN((CUTOFFSET*2)/(2*H197))),0)","v":0},null,null,null,null,null,null,null,null,null,126,{"$f":"IF(AND(SHAPEW>0,SHAPEH>0,DIM_3>0,SHAPE=126),11,0)","v":0},{"$f":"IF(S200>0,\"Max Width:\",0)","v":0},{"$f":"IF(S200>0,E181,0)","v":0},{"$f":"IF(AND(S200>0,SHAPEW>0,SHAPEW>U200),1,0)","v":0},null,null,null,null,198,"9409",108,80,108,96,204]
[null,null,"F",{"$f":"IF(AND(SHAPEW>0,SHAPEH>0,OFFSET>0,SHAPE=127),2*(ASIN((OFFSET*2)/(2*D198))),0)","v":0},null,"Cut @ Corners:",{"$f":"IF(AND(SHAPEW>0,SHAPEH>0,OFFSET>0,SHAPE=127),SQRT(CUTOFFSET^2+((SHAPEW/2)-(I199-I198))^2),0)","v":0},null,null,null,null,null,null,null,null,null,null,126,{"$f":"IF(AND(SHAPEW>0,SHAPEH>0,DIM_3>0,SHAPE=126),12,0)","v":0},{"$f":"IF(S201>0,\"Max Height:\",0)","v":0},{"$f":"IF(S201>0,F181,0)","v":0},{"$f":"IF(AND(S201>0,SHAPEH>0,SHAPEH>U201),1,0)","v":0},null,null,null,null,199,"9412",144,80,144,96,240]
[null,null,null,null,null,null,null,null,null,null,null,null,null,null,null,null,null,126,{"$f":"IF(AND(SHAPEW>0,SHAPEH>0,DIM_3>0,SHAPE=126),13,0)","v":0},{"$f":"IF(S202>0,\"Max UI:\",0)","v":0},{"$f":"IF(S202>0,G181,0)","v":0},{"$f":"IF(AND(S202>0,G182>0),1,0)","v":0},null,null,null,null,200,"9422",144,80,144,96,240]
[null,null,null,null,null,null,null,null,null,null,null,null,null,null,null,null,null,127,{"$f":"IF(AND(SHAPEW>0,SHAPEH>0,SHAPE=127),1,0)","v":0},{"$f":"IF(S203>0,\"Frame Radius:\",0)","v":0},{"$f":"IF(S203>0,D197,0)","v":0},{"$f":"IF(AND(S203>0,SHAPEW>0,SHAPEH>0,D197<C193),1,0)","v":0},null,null,null,null,201,"9475",75,80,75,80,155]
[null,128,"Min R","Max W","Max H","Min Leg","Max UI","Cut L","Min W",null,null,null,null,null,null,null,null,127,{"$f":"IF(AND(SHAPEW>0,SHAPEH>0,SHAPE=127),2,0)","v":0},{"$f":"IF(S204>0,\"Peak Cut Length:\",0)","v":0},{"$f":"IF(S204>0,G200,0)","v":0},{"$f":"IF(AND(S204>0,U204>G193),1,0)","v":0},null,null,null,null,1,{"$f":"IF(MODELLINK>1,VLOOKUP(MODELLINK,CHART,2,FALSE),\"\")","v":""},{"$f":"IF(MODELLINK>1,VLOOKUP(MODELLINK,CHART,3,FALSE),\"\")","v":""},{"$f":"IF(MODELLINK>1,VLOOKUP(MODELLINK,CHART,4,FALSE),\"\")","v":""},{"$f":"IF(MODELLINK>1,VLOOKUP(MODELLINK,CHART,5,FALSE),\"\")","v":""},{"$f":"IF(MODELLINK>1,VLOOKUP(MODELLINK,CHART,6,FALSE),\"\")","v":""},{"$f":"IF(MODELLINK>1,VLOOKUP(MODELLINK,CHART,7,FALSE),\"\")","v":""},{"$f":"IF(MODELLINK>1,VLOOKUP(MODELLINK,CHART,8,FALSE),\"\")","v":""}]
[null,{"$f":"EXT","v":1},{"$f":"MIN_R","v":""},{"$f":"MAX_W","v":""},{"$f":"MAX_H","v":""},{"$f":"MIN_LEG","v":""},{"$f":"MAX_UI","v":""},{"$f":"CUT_LENGTH","v":""},18,null,null,null,null,null,null,null,null,127,{"$f":"IF(AND(SHAPEW>0,SHAPEH>0,SHAPE=127),3,0)","v":0},{"$f":"IF(S205>0,\"Corner Cut Length:\",0)","v":0},{"$f":"IF(S205>0,G201,0)","v":0},{"$f":"IF(AND(S205>0,G201>G193),1,0)","v":0}]
[null,null,{"$f":"IF(AND(SHAPEW>0,SHAPEH>0,DIM_4>0,OFFSET>0,SHAPE=128,D208<C205),1,0)","v":0},{"$f":"IF(AND(SHAPEW>0,SHAPE=128,OFFSET>0,SHAPEW>D205),1,0)","v":0},{"$f":"IF(AND(SHAPEW>0,SHAPE=128,OFFSET>0,SHAPEH>E205),1,0)","v":0},{"$f":"IF(AND(SHAPEH>0,SHAPE=128,OFFSET>0,DIM_4<F205),1,0)","v":0},{"$f":"IF(AND(SHAPEW>0,SHAPEH>0,SHAPE=128,OFFSET>0,(SHAPEW+SHAPEH)>G205),1,0)","v":0},{"$f":"IF(AND(SHAPEW>0,SHAPEH>0,DIM_4>0,OFFSET>0,SHAPE=128,OR(G212>H205,G213>H205)),1,0)","v":0},{"$f":"IF(AND(SHAPEW>0,SHAPEH>0,SHAPE=128,SHAPE=127,OFFSET>0,SHAPEW<I205),1,0)","v":0},null,null,null,null,null,null,null,null,127,{"$f":"IF(AND(SHAPEW>0,SHAPEH>0,SHAPE=127),4,0)","v":0},{"$f":"IF(S206>0,\"Glas Width:\",0)","v":0},{"$f":"IF(S206>0,D199,0)","v":0},{"$f":"IF(AND(U206>0,U206<GlassMinW),1,0)","v":0}]
[null,null,{"$f":"MAX(C206:H206)","v":0},{"$f":"IF(AND(SHAPE=B204,C207=1),1,0)","v":0},null,{"$f":"IF(AND(SHAPEW>0,SHAPEH>0,(SHAPEH-DIM_4)<=(SHAPEW/2)),1,0)","v":0},{"$f":"IF(AND(SHAPE=128,F207=1),\"FRAME HEIGHT MINUS DIM4, MUST BE GREATER THAN 1/2 THE WIDTH\",IF(AND(SHAPE=128,SHAPEW>0,C206>0),\"RADIUS MUST BE GREATER THAN \"&C205,IF(AND(SHAPE=128,D210>0,D210<GlassMinW),\"Glass Width is Under Minimum\",IF(AND(SHAPE=128,D211>0,D211<GlassMinH),\"Glass Height is Under Minimum\",\"\"))))","v":""},null,null,null,null,null,null,null,null,null,null,127,{"$f":"IF(AND(SHAPEW>0,SHAPEH>0,SHAPE=127),5,0)","v":0},{"$f":"IF(S207>0,\"Glass Height:\",0)","v":0},{"$f":"IF(S207>0,D200,0)","v":0},{"$f":"IF(AND(U207>0,U207<GlassMinH),1,0)","v":0}]
[null,null,"Frame Radius:",{"$f":"IF(AND(SHAPEW>0,SHAPEH>0,DIM_4>0,OFFSET>0,SHAPE=128),(((SHAPEH-DIM_4))^2+(SHAPEW/2)^2)/(2*(SHAPEW/2)),0)","v":0},null,"F",{"$f":"IF(AND(SHAPEW>0,SHAPEH>0,DIM_4>0,OFFSET>0,SHAPE=128),2*(ASIN((OFFSET*2)/(2*D209))),0)","v":0},null,null,null,null,null,null,null,null,null,null,127,{"$f":"IF(AND(SHAPEW>0,SHAPEH>0,SHAPE=127),6,0)","v":0},{"$f":"IF(S208>0,\"Glass Radius:\",0)","v":0},{"$f":"IF(S208>0,D198,0)","v":0}]
[null,null,"Glass Radius:",{"$f":"IF(AND(SHAPEW>0,SHAPEH>0,DIM_4>0,OFFSET>0,SHAPE=128),D208-OFFSET,0)","v":0},null,"d",{"$f":"IF(AND(SHAPEW>0,SHAPEH>0,DIM_4>0,OFFSET>0,SHAPE=128),D209*COS(G208/2),0)","v":0},{"$f":"IF(AND(SHAPEW>0,SHAPEH>0,DIM_4>0,OFFSET>0,SHAPE=128),D208-CUTOFFSET,0)","v":0},{"$f":"IF(AND(SHAPEW>0,SHAPEH>0,DIM_4>0,OFFSET>0,SHAPE=128),2*(ASIN((CUTOFFSET*2)/(2*H209))),0)","v":0},null,null,null,null,null,null,null,null,127,{"$f":"IF(AND(SHAPEW>0,SHAPEH>0,SHAPE=127),7,0)","v":0},{"$f":"IF(S209>0,\"Max Width:\",0)","v":0},{"$f":"IF(S209>0,D193,0)","v":0},{"$f":"IF(AND(S209>0,SHAPEW>0,SHAPEW>U209),1,0)","v":0}]
[null,null,"Glass Width:",{"$f":"IF(AND(SHAPEW>0,SHAPEH>0,DIM_4>0,OFFSET>0,SHAPE=128),SHAPEW-(OFFSET*2),0)","v":0},null,"h",{"$f":"IF(AND(SHAPEW>0,SHAPEH>0,DIM_4>0,OFFSET>0,SHAPE=128),D209-G209,0)","v":0},{"$f":"IF(AND(SHAPEW>0,SHAPEH>0,DIM_4>0,OFFSET>0,SHAPE=128),SHAPEW-(CUTOFFSET*2),0)","v":0},{"$f":"IF(AND(SHAPEW>0,SHAPEH>0,DIM_4>0,OFFSET>0,SHAPE=128),H209*COS(I209/2),0)","v":0},null,null,null,null,null,null,null,null,127,{"$f":"IF(AND(SHAPEW>0,SHAPEH>0,SHAPE=127),8,0)","v":0},{"$f":"IF(S210>0,\"Max Height:\",0)","v":0},{"$f":"IF(S210>0,E193,0)","v":0},{"$f":"IF(AND(S210>0,SHAPEH>0,SHAPEH>U210),1,0)","v":0}]
[null,null,"Glass Height:",{"$f":"IF(AND(SHAPEW>0,SHAPEH>0,DIM_4>0,OFFSET>0,SHAPE=128),(((SQRT(G211*((2*D209)-G211))))-OFFSET)+DIM_4,0)","v":0},null,"h_Glass",{"$f":"IF(AND(SHAPEW>0,SHAPEH>0,DIM_4>0,OFFSET>0,SHAPE=128),((SHAPEW/2)-((OFFSET*2)+G210)+OFFSET+G210),0)","v":0},{"$f":"IF(AND(SHAPEW>0,SHAPEH>0,DIM_4>0,OFFSET>0,SHAPE=128),(((SQRT(I212*((2*H209)-I212))))-CUTOFFSET)+DIM_4,0)","v":0},{"$f":"IF(AND(SHAPEW>0,SHAPEH>0,DIM_4>0,OFFSET>0,SHAPE=128),H209-I210,0)","v":0},null,null,null,null,null,null,null,null,127,{"$f":"IF(AND(SHAPEW>0,SHAPEH>0,SHAPE=127),9,0)","v":0},{"$f":"IF(S211>0,\"Max UI:\",0)","v":0},{"$f":"IF(S211>0,F193,0)","v":0},{"$f":"IF(AND(S211>0,F194>0),1,0)","v":0}]
[null,null,"Glass Leg H:",{"$f":"IF(AND(SHAPEW>0,SHAPEH>0,DIM_4>0,OFFSET>0,SHAPE=128),DIM_4-OFFSET,0)","v":0},null,"Cut @ Peak:",{"$f":"IF(AND(SHAPEW>0,SHAPEH>0,DIM_4>0,OFFSET>0,SHAPE=128),SHAPEH-CUTOFFSET-H211,0)","v":0},{"$f":"IF(AND(SHAPEW>0,SHAPEH>0,DIM_4>0,OFFSET>0,SHAPE=128),DIM_4-CUTOFFSET,0)","v":0},{"$f":"IF(AND(SHAPEW>0,SHAPEH>0,DIM_4>0,OFFSET>0,SHAPE=128),((SHAPEW/2)-((CUTOFFSET*2)+I211)+CUTOFFSET+I211),0)","v":0},null,null,null,null,null,null,null,null,127,{"$f":"IF(AND(SHAPEW>0,SHAPEH>0,SHAPE=127),10,0)","v":0},{"$f":"IF(S212>0,\"Min Width:\",0)","v":0},{"$f":"IF(S212>0,H193,0)","v":0},{"$f":"IF(AND(S212>0,SHAPEH>0,SHAPEW<U212),1,0)","v":0}]
[null,null,null,null,null,"Cut @ Corners:",{"$f":"IF(AND(SHAPEW>0,SHAPEH>0,DIM_4>0,OFFSET>0,SHAPE=128),SQRT(CUTOFFSET^2+CUTOFFSET^2),0)","v":0},null,null,null,null,null,null,null,null,null,null,128,{"$f":"IF(AND(SHAPEW>0,SHAPEH>0,DIM_4>0,SHAPE=128),1,0)","v":0},{"$f":"IF(S213>0,\"Frame Radius:\",0)","v":0},{"$f":"IF(S213>0,D208,0)","v":0},{"$f":"IF(AND(S213>0,SHAPEW>0,SHAPEH>0,DIM_4>0,D208<C205),1,0)","v":0}]
[null,null,null,null,null,null,null,null,null,null,null,null,null,null,null,null,null,128,{"$f":"IF(AND(SHAPEW>0,SHAPEH>0,DIM_4>0,SHAPE=128),2,0)","v":0},{"$f":"IF(S214>0,\"Frame Leg:\",0)","v":0},{"$f":"IF(S214>0,DIM_4,0)","v":0},{"$f":"IF(AND(S214>0,DIM_4>0,F206>0),1,0)","v":0}]
[null,null,null,null,null,null,null,null,null,null,null,null,null,null,null,null,null,128,{"$f":"IF(AND(SHAPEW>0,SHAPEH>0,DIM_4>0,SHAPE=128),3,0)","v":0},{"$f":"IF(S215>0,\"Peak Cut Length:\",0)","v":0},{"$f":"IF(S215>0,G212,0)","v":0},{"$f":"IF(AND(S215>0,U215>H205),1,0)","v":0}]
[null,129,"Min Side","Min Cut","Max W","Max H","Max UI","Min Angle",null,null,null,null,null,null,null,null,null,128,{"$f":"IF(AND(SHAPEW>0,SHAPEH>0,DIM_4>0,SHAPE=128),4,0)","v":0},{"$f":"IF(S216>0,\"Corner Cut Length:\",0)","v":0},{"$f":"IF(S216>0,G213,0)","v":0},{"$f":"IF(AND(S216>0,U216>H205),1,0)","v":0}]
[null,{"$f":"EXT","v":1},{"$f":"MIN_LEG","v":""},{"$f":"CUT_LENGTH","v":""},{"$f":"MAX_W","v":""},{"$f":"MAX_H","v":""},{"$f":"MAX_UI","v":""},{"$f":"MIN_ANGLE","v":""},null,null,null,null,null,null,null,null,null,128,{"$f":"IF(AND(SHAPEW>0,SHAPEH>0,DIM_4>0,SHAPE=128),5,0)","v":0},{"$f":"IF(S217>0,\"Glas Width:\",0)","v":0},{"$f":"IF(S217>0,D210,0)","v":0},{"$f":"IF(AND(U217>0,U217<GlassMinW),1,0)","v":0}]
[null,null,{"$f":"IF(AND(SHAPEW>0,SHAPEH>0,DIM_3>0,OFFSET>0,SHAPE=129,OR(SHAPEW<C217,SHAPEH<C217,DIM_3<C217,G223<C217)),1,0)","v":0},{"$f":"IF(AND(SHAPEW>0,SHAPEH>0,DIM_3>0,OFFSET>0,SHAPE=129,OR(D222>D217,D223>D217,D224>D217,H222>D217,H223>D217,H224>D217)),1,0)","v":0},{"$f":"IF(AND(SHAPEW>0,SHAPE=129,OFFSET>0,SHAPEW>E217),1,0)","v":0},{"$f":"IF(AND(SHAPEW>0,SHAPE=129,OFFSET>0,SHAPEH>F217),1,0)","v":0},{"$f":"IF(AND(SHAPEW>0,SHAPEH>0,SHAPE=129,OFFSET>0,(SHAPEW+SHAPEH)>G217),1,0)","v":0},{"$f":"IF(AND(SHAPEW>0,SHAPEH>0,DIM_3>0,SHAPE=129,G224<H217),1,0)","v":0},null,null,null,null,null,null,null,null,null,128,{"$f":"IF(AND(SHAPEW>0,SHAPEH>0,DIM_4>0,SHAPE=128),6,0)","v":0},{"$f":"IF(S218>0,\"Glass Height:\",0)","v":0},{"$f":"IF(S218>0,D211,0)","v":0},{"$f":"IF(AND(U218>0,U218<GlassMinH),1,0)","v":0}]
[null,null,{"$f":"MAX(C218:G218)","v":0},{"$f":"IF(AND(SHAPE=B216,C219=1),1,0)","v":0},null,null,{"$f":"IF(AND(SHAPE=129,G221>0,G221<GlassMinW),\"Glass Width is Under Minimum\",IF(AND(SHAPE=129,G222>0,G222<GlassMinH),\"Glass Height is Under Minimum\",IF(AND(SHAPE=129,SHAPEW>0,SHAPEH>0,D221<0),\"Angle can not be negative\",\"\")))","v":""},null,null,null,null,null,null,null,null,null,null,128,{"$f":"IF(AND(SHAPEW>0,SHAPEH>0,DIM_4>0,SHAPE=128),7,0)","v":0},{"$f":"IF(S219>0,\"Glass Radius:\",0)","v":0},{"$f":"IF(S219>0,D209,0)","v":0}]
[null,null,null,null,null,null,null,null,null,null,null,null,null,null,null,null,null,128,{"$f":"IF(AND(SHAPEW>0,SHAPEH>0,DIM_4>0,SHAPE=128),8,0)","v":0},{"$f":"IF(S220>0,\"Glass Leg:\",0)","v":0},{"$f":"IF(S220>0,D212,0)","v":0}]
[null,null,"Roof Pitch:",{"$f":"IF(AND(SHAPEH>0,SHAPEW>0,DIM_3>0,OFFSET>0,SHAPE=129),DEGREES(ATAN((SHAPEH-DIM_3)/SHAPEW)),0)","v":0},null,"Glass Width:",{"$f":"IF(AND(SHAPEH>0,SHAPEW>0,DIM_3>0,OFFSET>0,SHAPE=129),SHAPEW-(OFFSET*2),0)","v":0},{"$f":"IF(AND(SHAPEH>0,DIM_3>0,SHAPEW>0,OFFSET>0,SHAPE=129),ROUND((12*((SHAPEH-DIM_3)/SHAPEW)),1)&\" /12\",0)","v":0},null,null,null,null,null,null,null,null,null,128,{"$f":"IF(AND(SHAPEW>0,SHAPEH>0,DIM_4>0,SHAPE=128),9,0)","v":0},{"$f":"IF(S221>0,\"Max Width:\",0)","v":0},{"$f":"IF(S221>0,D205,0)","v":0},{"$f":"IF(AND(S221>0,SHAPEW>0,SHAPEW>U221),1,0)","v":0}]
[null,null,"Peak & Slant Cut:",{"$f":"IF(AND(SHAPEW>0,SHAPEH>0,OFFSET>0,DIM_3>0,SHAPE=129),CUTOFFSET/SIN(RADIANS((90-D221)/2)),0)","v":0},null,"Glass Height:",{"$f":"IF(AND(SHAPEH>0,SHAPEW>0,DIM_3>0,OFFSET>0,SHAPE=129),SHAPEH-OFFSET-(SQRT(H222^2-OFFSET^2)),0)","v":0},{"$f":"IF(AND(SHAPEW>0,SHAPEH>0,OFFSET>0,DIM_3>0,SHAPE=129),OFFSET/SIN(RADIANS((90-D221)/2)),0)","v":0},null,null,null,null,null,null,null,null,null,128,{"$f":"IF(AND(SHAPEW>0,SHAPEH>0,DIM_4>0,SHAPE=128),10,0)","v":0},{"$f":"IF(S222>0,\"Min Width:\",0)","v":0},{"$f":"IF(S222>0,I205,0)","v":0},{"$f":"IF(AND(S222>0,SHAPEH>0,SHAPEW<U222),1,0)","v":0}]
[null,null,"Vert & Slant Cut:",{"$f":"IF(AND(SHAPEH>0,SHAPEW>0,DIM_3>0,OFFSET>0,SHAPE=129),CUTOFFSET/COS(RADIANS(((90-D221)/2))),0)","v":0},null,"Slanted Leg:",{"$f":"IF(AND(SHAPEH>0,SHAPEW>0,DIM_3>0,OFFSET>0,SHAPE=129),SQRT(SHAPEW^2+(SHAPEH-DIM_3)^2),0)","v":0},{"$f":"IF(AND(SHAPEH>0,SHAPEW>0,DIM_3>0,OFFSET>0,SHAPE=129),OFFSET/COS(RADIANS(((90-D221)/2))),0)","v":0},null,null,null,null,null,null,null,null,null,128,{"$f":"IF(AND(SHAPEW>0,SHAPEH>0,DIM_4>0,SHAPE=128),11,0)","v":0},{"$f":"IF(S223>0,\"Max Height:\",0)","v":0},{"$f":"IF(S223>0,E205,0)","v":0},{"$f":"IF(AND(S223>0,SHAPEH>0,SHAPEH>U223),1,0)","v":0}]
[null,null,"All 45O Cuts:",{"$f":"IF(AND(SHAPEH>0,SHAPEW>0,DIM_3>0,OFFSET>0,SHAPE=129),CUTOFFSET/COS(RADIANS(45)),0)","v":0},null,"Peak Cut Angle:",{"$f":"IF(AND(SHAPEH>0,SHAPEW>0,DIM_3>0,OFFSET>0,SHAPE=129),DEGREES(ASIN(CUTOFFSET/D222)),0)","v":0},{"$f":"IF(AND(SHAPEH>0,SHAPEW>0,DIM_3>0,OFFSET>0,SHAPE=129),OFFSET/COS(RADIANS(45)),0)","v":0},null,null,null,null,null,null,null,null,null,128,{"$f":"IF(AND(SHAPEW>0,SHAPEH>0,DIM_4>0,SHAPE=128),12,0)","v":0},{"$f":"IF(S224>0,\"Max UI:\",0)","v":0},{"$f":"IF(S224>0,G205,0)","v":0},{"$f":"IF(AND(S224>0,G206>0),1,0)","v":0}]
[null,null,"Glass Dim3:",{"$f":"IF(AND(SHAPEH>0,SHAPEW>0,DIM_3>0,OFFSET>0,SHAPE=129),DIM_3-OFFSET-(SQRT(H223^2-OFFSET^2)),0)","v":0},null,null,null,null,null,null,null,null,null,null,null,null,null,129,{"$f":"IF(AND(SHAPEW>0,SHAPEH>0,DIM_3>0,SHAPE=129),1,0)","v":0},{"$f":"IF(S225>0,\"Roof Pitch:\",0)","v":0},{"$f":"IF(S225>0,H221,0)","v":0},{"$f":"IF(AND(SHAPE=129,SHAPEW>0,SHAPEH>0,D221<0),1,0)","v":0}]
[null,null,null,null,null,null,null,null,null,null,null,null,null,null,null,null,null,129,{"$f":"IF(AND(SHAPEW>0,SHAPEH>0,DIM_3>0,SHAPE=129),2,0)","v":0},{"$f":"IF(S226>0,\"Slanted Leg Length:\",0)","v":0},{"$f":"IF(S226>0,G223,0)","v":0}]
[null,null,null,null,null,null,null,null,null,null,null,null,null,null,null,null,null,129,{"$f":"IF(AND(SHAPEW>0,SHAPEH>0,DIM_3>0,SHAPE=129),3,0)","v":0},{"$f":"IF(S227>0,\"Peak Cut Angle:\",0)","v":0},{"$f":"IF(S227>0,G224,0)","v":0},{"$f":"IF(AND(S227>0,H218>0),1,0)","v":0}]
[null,130,"Min Side","Min Cut","Max W","Max H","Max UI","Min Angle",null,null,null,null,null,null,null,null,null,129,{"$f":"IF(AND(SHAPEW>0,SHAPEH>0,DIM_3>0,SHAPE=129),4,0)","v":0},{"$f":"IF(S228>0,\"Peak Cut Length:\",0)","v":0},{"$f":"IF(S228>0,MAX(D222,H222),0)","v":0},{"$f":"IF(AND(S228>0,U228>D217),1,0)","v":0}]
[null,{"$f":"EXT","v":1},{"$f":"MIN_LEG","v":""},{"$f":"CUT_LENGTH","v":""},{"$f":"MAX_W","v":""},{"$f":"MAX_H","v":""},{"$f":"MAX_UI","v":""},{"$f":"MIN_ANGLE","v":""},null,null,null,null,null,null,null,null,null,129,{"$f":"IF(AND(SHAPEW>0,SHAPEH>0,DIM_3>0,SHAPE=129),5,0)","v":0},{"$f":"IF(S229>0,\"Leg & Slant Cut L:\",0)","v":0},{"$f":"IF(S229>0,MAX(D223,H223),0)","v":0},{"$f":"IF(AND(S229>0,U229>D217),1,0)","v":0}]
[null,null,{"$f":"IF(AND(SHAPEW>0,SHAPEH>0,SHAPE=130,OR(SHAPEW<C229,SHAPEH<C229)),1,0)","v":0},{"$f":"IF(AND(SHAPEW>0,SHAPEH>0,SHAPE=130,OFFSET>0,OR(D233>D229,D234>D229,D235>D229)),1,0)","v":0},{"$f":"IF(AND(SHAPEW>0,SHAPEH>0,OFFSET>0,SHAPE=130,SHAPEW>E229),1,0)","v":0},{"$f":"IF(AND(SHAPEW>0,SHAPEH>0,OFFSET>0,SHAPE=130,SHAPEH>F229),1,0)","v":0},{"$f":"IF(AND(SHAPEW>0,SHAPEH>0,OFFSET>0,SHAPE=130,(SHAPEW+SHAPEH)>G229),1,0)","v":0},{"$f":"IF(AND(SHAPEW>0,SHAPEH>0,OFFSET>0,SHAPE=130,OR(G235<H229,G236<H229)),1,0)","v":0},null,null,null,null,null,null,null,null,null,129,{"$f":"IF(AND(SHAPEW>0,SHAPEH>0,DIM_3>0,SHAPE=129),6,0)","v":0},{"$f":"IF(S230>0,\"Corner Cut L:\",0)","v":0},{"$f":"IF(S230>0,MAX(D224,H224),0)","v":0},{"$f":"IF(AND(S230>0,U230>D217),1,0)","v":0}]
[null,null,{"$f":"MAX(C230:H230)","v":0},{"$f":"IF(AND(SHAPE=B228,C231=1),1,0)","v":0},null,null,{"$f":"IF(AND(SHAPE=130,D236>0,D236<GlassMinW),\"Glass Width is Under Minimum\",IF(AND(SHAPE=130,G233>0,G233<GlassMinH),\"Glass Height is Under Minimum\",\"\"))","v":""},null,null,null,null,null,null,null,null,null,null,129,{"$f":"IF(AND(SHAPEW>0,SHAPEH>0,DIM_3>0,SHAPE=129),7,0)","v":0},{"$f":"IF(S231>0,\"Glass Width:\",0)","v":0},{"$f":"IF(S231>0,G221,0)","v":0},{"$f":"IF(AND(U231>0,U231<GlassMinW),1,0)","v":0}]
[null,null,null,null,null,null,null,null,null,null,null,null,null,null,null,null,null,129,{"$f":"IF(AND(SHAPEW>0,SHAPEH>0,DIM_3>0,SHAPE=129),8,0)","v":0},{"$f":"IF(S232>0,\"Glass Height:\",0)","v":0},{"$f":"IF(S232>0,G222,0)","v":0},{"$f":"IF(AND(U232>0,U232<GlassMinH),1,0)","v":0}]
[null,null,"Bottom Cut L:",{"$f":"IF(AND(SHAPEW>0,SHAPEH>0,OFFSET>0,SHAPE=130),CUTOFFSET/(SIN(RADIANS((DEGREES(ATAN(SHAPEH/SHAPEW)))/2))),0)","v":0},null,"Glass Height:",{"$f":"IF(AND(SHAPEW>0,SHAPEH>0,OFFSET>0,SHAPE=130),SHAPEH-OFFSET-(SQRT(H236^2-OFFSET^2)),0)","v":0},null,null,null,null,null,null,null,null,null,null,129,{"$f":"IF(AND(SHAPEW>0,SHAPEH>0,DIM_3>0,SHAPE=129),9,0)","v":0},{"$f":"IF(S233>0,\"Glass Leg:\",0)","v":0},{"$f":"IF(S233>0,D225,0)","v":0}]
[null,null,"Top Cut Length:",{"$f":"IF(AND(SHAPEW>0,SHAPEH>0,OFFSET>0,SHAPE=130),CUTOFFSET/(SIN(RADIANS((DEGREES(ATAN(SHAPEW/SHAPEH)))/2))),0)","v":0},null,"Roof Pitch:",{"$f":"IF(AND(SHAPEW>0,SHAPEH>0,OFFSET>0,SHAPE=130),DEGREES(ATAN(SHAPEH/SHAPEW)),0)","v":0},{"$f":"IF(AND(SHAPEW>0,SHAPEH>0,OFFSET>0,SHAPE=130),ROUND((12*(TAN(RADIANS(G234)))),1)&\" /12\",0)","v":0},null,null,null,null,null,null,null,null,null,129,{"$f":"IF(AND(SHAPEW>0,SHAPEH>0,DIM_3>0,SHAPE=129),10,0)","v":0},{"$f":"IF(S234>0,\"Min. Section:\",0)","v":0},{"$f":"IF(S234>0,C217,0)","v":0},{"$f":"IF(AND(SHAPEW>0,SHAPEH>0,U234>0,C218>0),1,0)","v":0}]
[null,null,"Corner Cut L:",{"$f":"IF(AND(SHAPEW>0,SHAPEH>0,OFFSET>0,SHAPE=130),SQRT(CUTOFFSET^2+CUTOFFSET^2),0)","v":0},null,"Peak Angle:",{"$f":"IF(AND(SHAPEW>0,SHAPEH>0,OFFSET>0,SHAPE=130),(180-G234-90)/2,0)","v":0},{"$f":"IF(AND(SHAPEW>0,SHAPEH>0,OFFSET>0,SHAPE=130),OFFSET/(SIN(RADIANS((DEGREES(ATAN(SHAPEH/SHAPEW)))/2))),0)","v":0},null,null,null,null,null,null,null,null,null,129,{"$f":"IF(AND(SHAPEW>0,SHAPEH>0,DIM_3>0,SHAPE=129),11,0)","v":0},{"$f":"IF(S235>0,\"Max Width:\",0)","v":0},{"$f":"IF(S235>0,E217,0)","v":0},{"$f":"IF(AND(S235>0,SHAPEW>0,SHAPEW>U235),1,0)","v":0}]
[null,null,"Glass Width:",{"$f":"IF(AND(SHAPEW>0,SHAPEH>0,OFFSET>0,SHAPE=130),SHAPEW-OFFSET-(SQRT(H235^2-OFFSET^2)),0)","v":0},null,"Bott Corner Angle:",{"$f":"IF(AND(SHAPEW>0,SHAPEH>0,OFFSET>0,SHAPE=130),G234/2,0)","v":0},{"$f":"IF(AND(SHAPEW>0,SHAPEH>0,OFFSET>0,SHAPE=130),OFFSET/(SIN(RADIANS((DEGREES(ATAN(SHAPEW/SHAPEH)))/2))),0)","v":0},null,null,null,null,null,null,null,null,null,129,{"$f":"IF(AND(SHAPEW>0,SHAPEH>0,DIM_3>0,SHAPE=129),12,0)","v":0},{"$f":"IF(S236>0,\"Max Height:\",0)","v":0},{"$f":"IF(S236>0,F217,0)","v":0},{"$f":"IF(AND(S236>0,SHAPEH>0,SHAPEH>U236),1,0)","v":0}]
[null,null,null,null,null,null,null,null,null,null,null,null,null,null,null,null,null,129,{"$f":"IF(AND(SHAPEW>0,SHAPEH>0,DIM_3>0,SHAPE=129),13,0)","v":0},{"$f":"IF(S237>0,\"Max UI:\",0)","v":0},{"$f":"IF(S237>0,G217,0)","v":0},{"$f":"IF(AND(S237>0,G218>0),1,0)","v":0}]
[null,null,null,null,null,null,null,null,null,null,null,null,null,null,null,null,null,130,{"$f":"IF(AND(SHAPEW>0,SHAPEH>0,SHAPE=130),1,0)","v":0},{"$f":"IF(S238>0,\"Roof Pitch:\",0)","v":0},{"$f":"IF(S238>0,H234,0)","v":0}]
[null,131,"Min Side","Min Cut","Max W","Max UI","Min W",null,null,null,null,null,null,null,null,null,null,130,{"$f":"IF(AND(SHAPEW>0,SHAPEH>0,SHAPE=130),2,0)","v":0},{"$f":"IF(S239>0,\"Min Side:\",0)","v":0},{"$f":"IF(S239>0,C217,0)","v":0},{"$f":"IF(AND(S239>0,C230>0),1,0)","v":0}]
[null,{"$f":"EXT","v":1},{"$f":"MIN_LEG","v":""},{"$f":"CUT_LENGTH","v":""},{"$f":"MAX_W","v":""},{"$f":"MAX_UI","v":""},12,null,null,null,null,null,null,null,null,null,null,130,{"$f":"IF(AND(SHAPEW>0,SHAPEH>0,SHAPE=130),3,0)","v":0},{"$f":"IF(S240>0,\"Peak Cut Angle:\",0)","v":0},{"$f":"IF(S240>0,G235,0)","v":0},{"$f":"IF(AND(S240>0,SHAPEW>0,SHAPEH>0,U240<H229),1,0)","v":0}]
[null,null,{"$f":"IF(AND(SHAPEW>0,OFFSET>0,SHAPE=131,SHAPEW<C240),1,0)","v":0},{"$f":"IF(AND(SHAPEW>0,OFFSET>0,SHAPE=131,OR(D244>D240,D245>D240)),1,0)","v":0},{"$f":"IF(AND(SHAPEW>0,OFFSET>0,SHAPE=131,SHAPEW>E240),1,0)","v":0},{"$f":"IF(AND(SHAPEW>0,OFFSET>0,SHAPE=131,(SHAPEW+G245)>F240),1,0)","v":0},{"$f":"IF(AND(SHAPEW>0,OFFSET>0,SHAPE=131,SHAPEW<G240),1,0)","v":0},null,null,null,null,null,null,null,null,null,null,130,{"$f":"IF(AND(SHAPEW>0,SHAPEH>0,SHAPE=130),4,0)","v":0},{"$f":"IF(S241>0,\"Peak Cut Length:\",0)","v":0},{"$f":"IF(S241>0,D234,0)","v":0},{"$f":"IF(AND(S241>0,U241>D229),1,0)","v":0}]
[null,null,{"$f":"MAX(C241:G241)","v":0},{"$f":"IF(AND(SHAPE=B239,C242=1),1,0)","v":0},null,{"$f":"IF(AND(SHAPE=131,D246>0,D246<GlassMinW),\"Glass Width is Under Minimum\",IF(AND(SHAPE=131,G244>0,G244<GlassMinH),\"Glass Height is Under Minimum\",\"\"))","v":""},null,null,null,null,null,null,null,null,null,null,null,130,{"$f":"IF(AND(SHAPEW>0,SHAPEH>0,SHAPE=130),5,0)","v":0},{"$f":"IF(S242>0,\"Sill & Slant Angle:\",0)","v":0},{"$f":"IF(S242>0,G236,0)","v":0},{"$f":"IF(AND(S242>0,SHAPEW>0,SHAPEH>0,U242<H229),1,0)","v":0}]
[null,null,null,null,null,null,null,null,null,null,null,null,null,null,null,null,null,130,{"$f":"IF(AND(SHAPEW>0,SHAPEH>0,SHAPE=130),6,0)","v":0},{"$f":"IF(S243>0,\"Sill & Slant Cut L:\",0)","v":0},{"$f":"IF(S243>0,D233,0)","v":0},{"$f":"IF(AND(S243>0,U243>D229),1,0)","v":0}]
[null,null,"Corner Cut L:",{"$f":"IF(AND(SHAPEW>0,OFFSET>0,SHAPE=131),CUTOFFSET/(SIN(RADIANS(30))),0)","v":0},null,"Glass Height:",{"$f":"IF(AND(SHAPEW>0,OFFSET>0,SHAPE=131),G245-OFFSET-H245,0)","v":0},{"$f":"IF(AND(SHAPEW>0,OFFSET>0,SHAPE=131),OFFSET/(SIN(RADIANS(30))),0)","v":0},null,null,null,null,null,null,null,null,null,130,{"$f":"IF(AND(SHAPEW>0,SHAPEH>0,SHAPE=130),7,0)","v":0},{"$f":"IF(S244>0,\"Corner Cut L:\",0)","v":0},{"$f":"IF(S244>0,D235,0)","v":0},{"$f":"IF(AND(S244>0,U244>D229),1,0)","v":0}]
[null,null,"Top Cut Length:",{"$f":"IF(AND(SHAPEW>0,OFFSET>0,SHAPE=131),CUTOFFSET/(SIN(RADIANS(30))),0)","v":0},null,"Frame Height:",{"$f":"IF(AND(SHAPEW>0,OFFSET>0,SHAPE=131),TRUNC((SHAPEW*SIN(RADIANS(60)))*32+0.5)/32,0)","v":0},{"$f":"IF(AND(SHAPEW>0,OFFSET>0,SHAPE=131),OFFSET/(SIN(RADIANS(30))),0)","v":0},null,null,null,null,null,null,null,null,null,130,{"$f":"IF(AND(SHAPEW>0,SHAPEH>0,SHAPE=130),8,0)","v":0},{"$f":"IF(S245>0,\"Glass Width:\",0)","v":0},{"$f":"IF(S245>0,D236,0)","v":0},{"$f":"IF(AND(U245>0,U245<GlassMinW),1,0)","v":0}]
[null,null,"Glass Width:",{"$f":"IF(AND(SHAPEW>0,OFFSET>0,SHAPE=131),SHAPEW-((SQRT(H244^2-OFFSET^2))*2),0)","v":0},null,"Roof Pitch:",{"$f":"IF(AND(SHAPEW>0,OFFSET>0,SHAPE=131),ROUND((TAN(RADIANS((60)))*12),1)&\" /12\",0)","v":0},null,null,null,null,null,null,null,null,null,null,130,{"$f":"IF(AND(SHAPEW>0,SHAPEH>0,SHAPE=130),9,0)","v":0},{"$f":"IF(S246>0,\"Glass Height:\",0)","v":0},{"$f":"IF(S246>0,G233,0)","v":0},{"$f":"IF(AND(U246>0,U246<GlassMinH),1,0)","v":0}]
[null,null,null,null,null,null,null,null,null,null,null,null,null,null,null,null,null,130,{"$f":"IF(AND(SHAPEW>0,SHAPEH>0,SHAPE=130),10,0)","v":0},{"$f":"IF(S247>0,\"Max Width:\",0)","v":0},{"$f":"IF(S247>0,E229,0)","v":0},{"$f":"IF(AND(S247>0,SHAPEW>0,SHAPEW>U247),1,0)","v":0}]
[null,null,null,null,null,null,null,null,null,null,null,null,null,null,null,null,null,130,{"$f":"IF(AND(SHAPEW>0,SHAPEH>0,SHAPE=130),11,0)","v":0},{"$f":"IF(S248>0,\"Max Height:\",0)","v":0},{"$f":"IF(S248>0,F229,0)","v":0},{"$f":"IF(AND(S248>0,SHAPEH>0,SHAPEH>U248),1,0)","v":0}]
[null,132,"Min Side","Min Cut","Max W","Max H","Max UI","Min Angle","Min W",null,null,null,null,null,null,null,null,130,{"$f":"IF(AND(SHAPEW>0,SHAPEH>0,SHAPE=130),12,0)","v":0},{"$f":"IF(S249>0,\"Max UI:\",0)","v":0},{"$f":"IF(S249>0,G229,0)","v":0},{"$f":"IF(AND(S249>0,G230>0),1,0)","v":0}]
[null,{"$f":"EXT","v":1},{"$f":"MIN_LEG","v":""},{"$f":"CUT_LENGTH","v":""},{"$f":"MAX_W","v":""},{"$f":"MAX_H","v":""},{"$f":"MAX_UI","v":""},{"$f":"MIN_ANGLE","v":""},12,null,null,null,null,null,null,null,null,131,{"$f":"IF(AND(SHAPEW>0,SHAPE=131),1,0)","v":0},{"$f":"IF(S250>0,\"Roof Pitch:\",0)","v":0},{"$f":"IF(S250>0,G246,0)","v":0}]
[null,null,{"$f":"IF(AND(SHAPEW>0,SHAPEH>0,OFFSET>0,SHAPE=132,OR(SHAPEW<C250,G255<C250)),1,0)","v":0},{"$f":"IF(AND(SHAPEW>0,SHAPEH>0,OFFSET>0,SHAPE=132,OR(D253>D250,D254>D250)),1,0)","v":0},{"$f":"IF(AND(SHAPEW>0,SHAPEH>0,OFFSET>0,SHAPE=132,SHAPEW>E250),1,0)","v":0},{"$f":"IF(AND(SHAPEW>0,SHAPEH>0,OFFSET>0,SHAPE=132,SHAPEH>F250),1,0)","v":0},{"$f":"IF(AND(SHAPEW>0,SHAPEH>0,OFFSET>0,SHAPE=132,(SHAPEW+SHAPEH)>G250),1,0)","v":0},{"$f":"IF(AND(SHAPEW>0,SHAPEH>0,OFFSET>0,SHAPE=130,OR(G253<H250,G254<H250)),1,0)","v":0},{"$f":"IF(AND(SHAPEW>0,SHAPEH>0,SHAPE=132,OFFSET>0,SHAPEW<I250),1,0)","v":0},null,null,null,null,null,null,null,null,131,{"$f":"IF(AND(SHAPEW>0,SHAPE=131),2,0)","v":0},{"$f":"IF(S251>0,\"Frame Height:\",0)","v":0},{"$f":"IF(S251>0,G245,0)","v":0}]
[null,null,{"$f":"MAX(C251:I251)","v":0},{"$f":"IF(AND(SHAPE=B249,C252=1),1,0)","v":0},null,null,{"$f":"IF(AND(SHAPE=132,D255>0,D255<GlassMinW),\"Glass Width is Under Minimum\",IF(AND(SHAPE=132,D256>0,D256<GlassMinH),\"Glass Height is Under Minimum\",\"\"))","v":""},null,null,null,null,null,null,null,null,null,null,131,{"$f":"IF(AND(SHAPEW>0,SHAPE=131),3,0)","v":0},{"$f":"IF(S252>0,\"All Cut Length:\",0)","v":0},{"$f":"IF(S252>0,D244,0)","v":0},{"$f":"IF(AND(S252>0,D241>0),1,0)","v":0}]
[null,null,"Bottom Cut L:",{"$f":"IF(AND(SHAPEW>0,SHAPEH>0,OFFSET>0,SHAPE=132),CUTOFFSET/(SIN(RADIANS(G253/2))),0)","v":0},null,"Bottom Angles:",{"$f":"IF(AND(SHAPEW>0,SHAPEH>0,OFFSET>0,SHAPE=132),DEGREES(ATAN(SHAPEH/(SHAPEW/2))),0)","v":0},null,null,null,null,null,null,null,null,null,null,131,{"$f":"IF(AND(SHAPEW>0,SHAPE=131),4,0)","v":0},{"$f":"IF(S253>0,\"All Cut Angles:\",0)","v":0},{"$f":"IF(S253>0,30,0)","v":0}]
[null,null,"Top Cut Length:",{"$f":"IF(AND(SHAPEW>0,SHAPEH>0,OFFSET>0,SHAPE=132),CUTOFFSET/(SIN(RADIANS(G254/2))),0)","v":0},null,"Peak Angle:",{"$f":"IF(AND(SHAPEW>0,SHAPEH>0,OFFSET>0,SHAPE=132),180-(G253*2),0)","v":0},{"$f":"IF(AND(SHAPEW>0,SHAPEH>0,OFFSET>0,SHAPE=132),ROUND((12*(TAN(RADIANS(G253)))),1)&\" /12\",0)","v":0},"Roof Pitch",null,null,null,null,null,null,null,null,131,{"$f":"IF(AND(SHAPEW>0,SHAPE=131),5,0)","v":0},{"$f":"IF(S254>0,\"Glass Width:\",0)","v":0},{"$f":"IF(S254>0,D246,0)","v":0},{"$f":"IF(AND(U254>0,U254<GlassMinW),1,0)","v":0}]
[null,null,"Glass Width:",{"$f":"IF(AND(SHAPEW>0,SHAPEH>0,OFFSET>0,SHAPE=132),SHAPEW-((SQRT(G256^2-OFFSET^2))*2),0)","v":0},null,"Sides Length:",{"$f":"IF(AND(SHAPEW>0,SHAPEH>0,OFFSET>0,SHAPE=132),SQRT(SHAPEH^2+(SHAPEW/2)^2),0)","v":0},null,null,null,null,null,null,null,null,null,null,131,{"$f":"IF(AND(SHAPEW>0,SHAPE=131),6,0)","v":0},{"$f":"IF(S255>0,\"Glass Height:\",0)","v":0},{"$f":"IF(S255>0,G244,0)","v":0},{"$f":"IF(AND(U255>0,U255<GlassMinH),1,0)","v":0}]
[null,null,"Glass Height:",{"$f":"IF(AND(SHAPEW>0,SHAPEH>0,OFFSET>0,SHAPE=132),SHAPEH-OFFSET-G257,0)","v":0},null,null,{"$f":"IF(AND(SHAPEW>0,SHAPEH>0,OFFSET>0,SHAPE=132),OFFSET/(SIN(RADIANS(G253/2))),0)","v":0},null,null,null,null,null,null,null,null,null,null,131,{"$f":"IF(AND(SHAPEW>0,SHAPE=131),7,0)","v":0},{"$f":"IF(S256>0,\"Max Width:\",0)","v":0},{"$f":"IF(S256>0,E240,0)","v":0},{"$f":"IF(AND(S256>0,SHAPEW>0,SHAPEW>U256),1,0)","v":0}]
[null,null,null,null,null,null,{"$f":"IF(AND(SHAPEW>0,SHAPEH>0,OFFSET>0,SHAPE=132),OFFSET/(SIN(RADIANS(G254/2))),0)","v":0},null,null,null,null,null,null,null,null,null,null,131,{"$f":"IF(AND(SHAPEW>0,SHAPE=131),8,0)","v":0},{"$f":"IF(S257>0,\"Max UI:\",0)","v":0},{"$f":"IF(S257>0,F240,0)","v":0},{"$f":"IF(AND(S257>0,F241>0),1,0)","v":0}]
[null,null,null,null,null,null,null,null,null,null,null,null,null,null,null,null,null,131,{"$f":"IF(AND(SHAPEW>0,SHAPE=131),9,0)","v":0},{"$f":"IF(S258>0,\"Min Width:\",0)","v":0},{"$f":"IF(S258>0,G240,0)","v":0},{"$f":"IF(AND(S258>0,SHAPEW>0,G241>0),1,0)","v":0}]
[null,null,null,null,null,null,null,null,null,null,null,null,null,null,null,null,null,132,{"$f":"IF(AND(SHAPEW>0,SHAPEH>0,SHAPE=132),1,0)","v":0},{"$f":"IF(S259>0,\"Roof Pitch:\",0)","v":0},{"$f":"IF(S259>0,H254,0)","v":0}]
[null,null,null,null,null,null,null,null,null,null,null,null,null,null,null,null,null,132,{"$f":"IF(AND(SHAPEW>0,SHAPEH>0,SHAPE=132),2,0)","v":0},{"$f":"IF(S260>0,\"Min Side:\",0)","v":0},{"$f":"IF(S260>0,C250,0)","v":0},{"$f":"IF(AND(S260>0,C251>0),1,0)","v":0}]
[null,null,null,null,null,null,null,null,null,null,null,null,null,null,null,null,null,132,{"$f":"IF(AND(SHAPEW>0,SHAPEH>0,SHAPE=132),3,0)","v":0},{"$f":"IF(S261>0,\"Sides Length:\",0)","v":0},{"$f":"IF(S261>0,G255,0)","v":0},{"$f":"IF(AND(S261>0,C251>0),1,0)","v":0}]
[null,null,null,null,null,null,null,null,null,null,null,null,null,null,null,null,null,132,{"$f":"IF(AND(SHAPEW>0,SHAPEH>0,SHAPE=132),4,0)","v":0},{"$f":"IF(S262>0,\"Peak Cut Angle:\",0)","v":0},{"$f":"IF(S262>0,G254/2,0)","v":0},{"$f":"IF(AND(S262>0,SHAPEW>0,SHAPEH>0,U262<H250),1,0)","v":0}]
[null,null,null,null,null,null,null,null,null,null,null,null,null,null,null,null,null,132,{"$f":"IF(AND(SHAPEW>0,SHAPEH>0,SHAPE=132),5,0)","v":0},{"$f":"IF(S263>0,\"Peak Cut L:\",0)","v":0},{"$f":"IF(S263>0,D254,0)","v":0},{"$f":"IF(AND(S263>0,U263>D250),1,0)","v":0}]
[null,null,null,null,null,null,null,null,null,null,null,null,null,null,null,null,null,132,{"$f":"IF(AND(SHAPEW>0,SHAPEH>0,SHAPE=132),6,0)","v":0},{"$f":"IF(S264>0,\"Corner Cut Angle:\",0)","v":0},{"$f":"IF(S264>0,G253/2,0)","v":0},{"$f":"IF(AND(S264>0,SHAPEW>0,SHAPEH>0,U264<H250),1,0)","v":0}]
[null,null,null,null,null,null,null,null,null,null,null,null,null,null,null,null,null,132,{"$f":"IF(AND(SHAPEW>0,SHAPEH>0,SHAPE=132),7,0)","v":0},{"$f":"IF(S265>0,\"Corner Cut L:\",0)","v":0},{"$f":"IF(S265>0,D253,0)","v":0},{"$f":"IF(AND(S265>0,U265>D250),1,0)","v":0}]
[null,null,null,null,null,null,null,null,null,null,null,null,null,null,null,null,null,132,{"$f":"IF(AND(SHAPEW>0,SHAPEH>0,SHAPE=132),8,0)","v":0},{"$f":"IF(S266>0,\"Glass Width:\",0)","v":0},{"$f":"IF(S266>0,D255,0)","v":0},{"$f":"IF(AND(U266>0,U266<GlassMinW),1,0)","v":0}]
[null,null,null,null,null,null,null,null,null,null,null,null,null,null,null,null,null,132,{"$f":"IF(AND(SHAPEW>0,SHAPEH>0,SHAPE=132),9,0)","v":0},{"$f":"IF(S267>0,\"Glass Height:\",0)","v":0},{"$f":"IF(S267>0,D256,0)","v":0},{"$f":"IF(AND(U267>0,U267<GlassMinH),1,0)","v":0}]
[null,null,null,null,null,null,null,null,null,null,null,null,null,null,null,null,null,132,{"$f":"IF(AND(SHAPEW>0,SHAPEH>0,SHAPE=132),10,0)","v":0},{"$f":"IF(S268>0,\"Max Width:\",0)","v":0},{"$f":"IF(S268>0,E250,0)","v":0},{"$f":"IF(AND(S268>0,SHAPEW>0,SHAPEW>U268),1,0)","v":0}]
[null,null,null,null,null,null,null,null,null,null,null,null,null,null,null,null,null,132,{"$f":"IF(AND(SHAPEW>0,SHAPEH>0,SHAPE=132),11,0)","v":0},{"$f":"IF(S269>0,\"Max Height:\",0)","v":0},{"$f":"IF(S269>0,F250,0)","v":0},{"$f":"IF(AND(S269>0,SHAPEH>U269),1,0)","v":0}]
[null,null,null,null,null,null,null,null,null,null,null,null,null,null,null,null,null,132,{"$f":"IF(AND(SHAPEW>0,SHAPEH>0,SHAPE=132),12,0)","v":0},{"$f":"IF(S270>0,\"Max UI:\",0)","v":0},{"$f":"IF(S270>0,G250,0)","v":0},{"$f":"IF(AND(S270>0,G251>0),1,0)","v":0}]
[null,null,null,null,null,null,null,null,null,null,null,null,null,null,null,null,null,132,{"$f":"IF(AND(SHAPEW>0,SHAPEH>0,SHAPE=132),13,0)","v":0},{"$f":"IF(S271>0,\"Min Widht:\",0)","v":0},{"$f":"IF(S271>0,I250,0)","v":0},{"$f":"IF(AND(S271>0,I251>0),1,0)","v":0}]

{"sheet":"Data","index":2,"n_rows":76,"n_cols":38,"rows_kept":76,"cut":false,"hidden":true,"merged":[]}
[]
[null,"Min. W","Min. H 113","Min. H 115","Max. W","Max. H","Max. UI","Max. SF","Min. R","Min. Leg","CutLength","Min. Angle",null,"Min. Width",105,110,111,112,113,114,115,116,117,118,119,120,121,122,123,124,125,126,127,128,129,130,131,132]
["SH2201",{"$f":"SH_2201","v":10},{"$f":"(TRUNC(SQRT(SHAPEW+5)*16+0.5)/16)+2","v":4.25},{"$f":"(TRUNC(SQRT(SHAPEW+5)*16+0.5)/16)+2","v":4.25},95,95,154,56,{"$f":"SH_2201","v":10},6,7.4375,8.5,null,"Mezzo",25,25,12.5,12.5,25,14,13,13,36,24,29,18,18,18,18,12,18,18,18,18,12,16,15,14]
["PWFO1",{"$f":"PWF_01","v":10},{"$f":"(TRUNC(SQRT(SHAPEW+5)*16+0.5)/16)+2.25","v":4.5},{"$f":"(TRUNC(SQRT(SHAPEW+5)*16+0.5)/16)+2.25","v":4.5},96,96,154,56,{"$f":"PWF_01","v":10},6,7.4375,8.8000000000000007,null,"Mezzo w/NF",26,26,13,13,25,14,13,13,36,24,29,18,18,18,18,12,18,18,18,18,12,16,15,14]
[3180,{"$f":"EXCAL","v":11.75},{"$f":"(TRUNC(SQRT(SHAPEW+7.25)*16+0.5)/16)+3.5","v":6.1875},{"$f":"(TRUNC(SQRT(SHAPEW+7.25)*16+0.5)/16)+3.5","v":6.1875},96,96,154,56,{"$f":"EXCAL","v":11.75},6,7.4375,12,null,"New Construction",20,20,11.5,11.5,24,12,12,12,36,20,24,16,16,16,16,12,18,18,18,18,12,16,15,14]
["PI2101",{"$f":"PI_2101","v":13.75},{"$f":"(TRUNC(SQRT(SHAPEW+7.75)*16+0.5)/16)+4.25","v":7.0625},{"$f":"(TRUNC(SQRT(SHAPEW+7.75)*16+0.5)/16)+4.25","v":7.0625},72,84,136,40,{"$f":"PI_2101","v":13.75},6,7.4375,14.3,null,"New Cons. Gold/Silver",25,25,12.5,12.5,25,14,13,13,36,24,29,18,18,18,18,12,18,18,18,18,12,16,15,14]
["V-Series",{"$f":"V_SERIES","v":12.5},{"$f":"(TRUNC(SQRT(SHAPEW+5.75)*16+0.5)/16)+3.625","v":6},6,96,96,154,56,{"$f":"V_SERIES","v":12.5},6,7.4375,10.6,null,"0700",20,20,11.5,11.5,20,12,12,12,36,20,24,16,16,16,16,12,18,18,18,18,12,16,15,14]
["SH46",{"$f":"SH_46","v":12.5},6,6,96,96,154,56,{"$f":"SH_46","v":12.5},6,7.4375,10.6,null,"Casement/U.Maxx/8000/9000",20,20,11.5,11.5,20,12,13,13,36,20,24,16,16,16,16,12,18,18,18,18,12,16,15,14]
["SH5702",{"$f":"SH_5702","v":12.5},6,6,96,96,154,56,{"$f":"SH_5702","v":12.5},6,7.4375,10.6,null,1700,25,25,12.5,12.5,25,14,13,13,36,24,29,18,18,18,18,12,18,18,18,18,12,16,15,14]
["Pi5801",{"$f":"PI_5801","v":12.5},6,6,96,96,154,56,{"$f":"PI_5801","v":12.5},6,7.4375,10.6,null,1900,25,25,12.5,12.5,25,14,13,13,36,24,29,18,18,18,18,12,18,18,18,18,12,16,15,14]
["Pi7301",{"$f":"PI_7301","v":12.5},{"$f":"(TRUNC(SQRT(SHAPEW+5.75)*16+0.5)/16)+2.875","v":5.25},{"$f":"(TRUNC(SQRT(SHAPEW+5.75)*16+0.5)/16)+2.875","v":5.25},96,96,154,56,{"$f":"PI_7301","v":12.5},6,7.4375,10.6,null,1901,25,25,12.5,12.5,25,14,13,13,36,24,29,18,18,18,18,12,18,18,18,18,12,16,15,14]
[3954,{"$f":"MEZZO","v":12.5},{"$f":"(TRUNC(SQRT(SHAPEW+7.75)*16+0.5)/16)+4.1875","v":7},{"$f":"(TRUNC(SQRT(SHAPEW+7.75)*16+0.5)/16)+4.1875","v":7},96,96,154,56,{"$f":"MEZZO","v":12.5},6,7.4375,14.3,null,"Impact 3100",27.5,27.5,13.75,null,27.5,18,null,18,null,27.5,null,null,null,16,null,null,null,null,null,null,12,16]
["3954F",{"$f":"MEZZO","v":12.5},{"$f":"(TRUNC(SQRT(SHAPEW+7.75)*16+0.5)/16)+4.1875","v":7},{"$f":"(TRUNC(SQRT(SHAPEW+7.75)*16+0.5)/16)+4.1875","v":7},96,96,154,56,{"$f":"MEZZONF","v":13},6,7.4375,14.3,null,"REGENCY Pi7301",25,25,12.5,12.5,25,14,13,13,36,24,29,18,18,18,18,12,18,18,18,18,12,16,15,14]
[null,{"$f":"IF(EXT=1,\"\",VLOOKUP(SHAPE,MINMAXTABLE,2,FALSE))","v":""},{"$f":"IF(EXT=1,\"\",VLOOKUP(SHAPE,MINMAXTABLE,3,FALSE))","v":""},{"$f":"IF(EXT=1,\"\",VLOOKUP(SHAPE,MINMAXTABLE,3,FALSE))","v":""},{"$f":"IF(EXT=1,\"\",VLOOKUP(SHAPE,MINMAXTABLE,4,FALSE))","v":""},{"$f":"IF(EXT=1,\"\",VLOOKUP(SHAPE,MINMAXTABLE,5,FALSE))","v":""},{"$f":"IF(EXT=1,\"\",VLOOKUP(SHAPE,MINMAXTABLE,6,FALSE))","v":""},{"$f":"IF(EXT=1,\"\",VLOOKUP(EXT,DATA,8,FALSE))","v":""},{"$f":"IF(EXT=1,\"\",VLOOKUP(EXT,DATA,9,FALSE))","v":""},{"$f":"IF(EXT=1,\"\",VLOOKUP(EXT,DATA,10,FALSE))","v":""},{"$f":"IF(EXT=1,\"\",VLOOKUP(EXT,DATA,11,FALSE))","v":""},{"$f":"IF(EXT=1,\"\",VLOOKUP(EXT,DATA,12,FALSE))","v":""},null,"I-Series",23.5,23.5,12,null,23.5,18,null,18,null,23.5,null,null,null,16,null,null,null,null,null,null,12,16]
[null,null,null,null,null,null,null,null,null,null,null,null,null,"Excalibur / Fusion",23.5,23.5,12,12,23.5,18,12,12,36,23.5,24,16,16,16,16,12,16,16,16,18,12,16,15,14]
[null,"Min. W","Min. H","Max. W","Max. H","Max. UI","Glass_W","Glass_H",null,null,null,null,null,null,{"$f":"IF(EXT>1,VLOOKUP(EXTRUSION,MINWIDTHTABLE,2,FALSE),0)","v":0},{"$f":"IF(EXT>1,VLOOKUP(EXTRUSION,MINWIDTHTABLE,3,FALSE),0)","v":0},{"$f":"IF(EXT>1,VLOOKUP(EXTRUSION,MINWIDTHTABLE,4,FALSE),0)","v":0},{"$f":"IF(EXT>1,VLOOKUP(EXTRUSION,MINWIDTHTABLE,5,FALSE),0)","v":0},{"$f":"IF(EXT>1,VLOOKUP(EXTRUSION,MINWIDTHTABLE,6,FALSE),0)","v":0},{"$f":"IF(EXT>1,VLOOKUP(EXTRUSION,MINWIDTHTABLE,7,FALSE),0)","v":0},{"$f":"IF(EXT>1,VLOOKUP(EXTRUSION,MINWIDTHTABLE,8,FALSE),0)","v":0},{"$f":"IF(EXT>1,VLOOKUP(EXTRUSION,MINWIDTHTABLE,9,FALSE),0)","v":0},{"$f":"IF(EXT>1,VLOOKUP(EXTRUSION,MINWIDTHTABLE,10,FALSE),0)","v":0},{"$f":"IF(EXT>1,VLOOKUP(EXTRUSION,MINWIDTHTABLE,11,FALSE),0)","v":0},{"$f":"IF(EXT>1,VLOOKUP(EXTRUSION,MINWIDTHTABLE,12,FALSE),0)","v":0},{"$f":"IF(EXT>1,VLOOKUP(EXTRUSION,MINWIDTHTABLE,13,FALSE),0)","v":0},{"$f":"IF(EXT>1,VLOOKUP(EXTRUSION,MINWIDTHTABLE,14,FALSE),0)","v":0},{"$f":"IF(EXT>1,VLOOKUP(EXTRUSION,MINWIDTHTABLE,15,FALSE),0)","v":0},{"$f":"IF(EXT>1,VLOOKUP(EXTRUSION,MINWIDTHTABLE,16,FALSE),0)","v":0},{"$f":"IF(EXT>1,VLOOKUP(EXTRUSION,MINWIDTHTABLE,17,FALSE),0)","v":0},{"$f":"IF(EXT>1,VLOOKUP(EXTRUSION,MINWIDTHTABLE,18,FALSE),0)","v":0},{"$f":"IF(EXT>1,VLOOKUP(EXTRUSION,MINWIDTHTABLE,19,FALSE),0)","v":0},{"$f":"IF(EXT>1,VLOOKUP(EXTRUSION,MINWIDTHTABLE,20,FALSE),0)","v":0},{"$f":"IF(EXT>1,VLOOKUP(EXTRUSION,MINWIDTHTABLE,21,FALSE),0)","v":0},{"$f":"IF(EXT>1,VLOOKUP(EXTRUSION,MINWIDTHTABLE,22,FALSE),0)","v":0},{"$f":"IF(EXT>1,VLOOKUP(EXTRUSION,MINWIDTHTABLE,23,FALSE),0)","v":0},{"$f":"IF(EXT>1,VLOOKUP(EXTRUSION,MINWIDTHTABLE,24,FALSE),0)","v":0},{"$f":"IF(EXT>1,VLOOKUP(EXTRUSION,MINWIDTHTABLE,25,FALSE),0)","v":0}]
[105,{"$f":"$O$16","v":0},{"$f":"$O$31","v":0},{"$f":"$O$46","v":0},{"$f":"$O$61","v":0},{"$f":"$O$76","v":0},{"$f":"'Shape Limits'!I5","v":0},{"$f":"'Shape Limits'!I4","v":0},null,null,null,null,null,"Min. Height",105,110,111,112,113,114,115,116,117,118,119,120,121,122,123,124,125,126,127,128,129,130,131,132]
[110,{"$f":"$P$16","v":0},{"$f":"$P$31","v":0},{"$f":"$P$46","v":0},{"$f":"$P$61","v":0},{"$f":"$P$76","v":0},{"$f":"'Shape Limits'!J11","v":0},{"$f":"'Shape Limits'!J12","v":0},null,null,null,null,null,"Mezzo",12.5,12.75,12.5,12.75,{"$f":"(TRUNC(SQRT(SHAPEW+7.75)*16+0.5)/16)+4.1875","v":7},12,{"$f":"(TRUNC(SQRT(SHAPEW+7.75)*16+0.5)/16)+4.1875","v":7},13,15,24,29,18,18,18,18,18.4375,18,18,18,24,12,16,13,12]
[111,{"$f":"$Q$16","v":0},{"$f":"$Q$31","v":0},{"$f":"$Q$46","v":0},{"$f":"$Q$61","v":0},{"$f":"$Q$76","v":0},{"$f":"'Shape Limits'!I23","v":0},{"$f":"'Shape Limits'!I23","v":0},null,null,null,null,null,"Mezzo w/NF",13,13.25,13,13,{"$f":"(TRUNC(SQRT(SHAPEW+7.75)*16+0.5)/16)+4.1875","v":7},12,{"$f":"(TRUNC(SQRT(SHAPEW+7.75)*16+0.5)/16)+4.1875","v":7},13,15,24,29,18,18,18,18,18.4375,18,18,18,24,12,16,13,12]
[112,{"$f":"$R$16","v":0},{"$f":"$R$31","v":0},{"$f":"$R$46","v":0},{"$f":"$R$61","v":0},{"$f":"$R$76","v":0},{"$f":"'Shape Limits'!J32","v":0},{"$f":"'Shape Limits'!J33","v":0},null,null,null,null,null,"New Construction",10,10.25,11.5,11.75,{"$f":"(TRUNC(SQRT(SHAPEW+5)*16+0.5)/16)+2","v":4.25},12,{"$f":"(TRUNC(SQRT(SHAPEW+5)*16+0.5)/16)+2","v":4.25},12,13,20,24,16,16,16,16,18.4375,18,18,18,24,12,16,13,12]
[113,{"$f":"$S$16","v":0},{"$f":"$S$31","v":0},{"$f":"$S$46","v":0},{"$f":"$S$61","v":0},{"$f":"$S$76","v":0},{"$f":"'Shape Limits'!J43","v":0},{"$f":"'Shape Limits'!J42","v":0},null,null,null,null,null,"New Cons. Gold/Silver",12.5,12.75,12.5,12.75,{"$f":"(TRUNC(SQRT(SHAPEW+5.75)*16+0.5)/16)+3.625","v":6},12,{"$f":"(TRUNC(SQRT(SHAPEW+5.75)*16+0.5)/16)+3.625","v":6},13,15,24,29,18,18,18,18,18.4375,18,18,18,24,12,16,13,12]
[114,{"$f":"$T$16","v":0},{"$f":"$T$31","v":0},{"$f":"$T$46","v":0},{"$f":"$T$61","v":0},{"$f":"$T$76","v":0},{"$f":"'Shape Limits'!J51","v":0},{"$f":"'Shape Limits'!J50","v":0},null,null,null,null,null,"0700",10,10.25,11.5,11.75,{"$f":"(TRUNC(SQRT(SHAPEW+5)*16+0.5)/16)+2","v":4.25},12,{"$f":"(TRUNC(SQRT(SHAPEW+5)*16+0.5)/16)+2","v":4.25},12,13,20,24,16,16,16,16,18.4375,18,18,18,24,12,12,13,12]
[115,{"$f":"$U$16","v":0},{"$f":"$U$31","v":0},{"$f":"$U$46","v":0},{"$f":"$U$61","v":0},{"$f":"$U$76","v":0},{"$f":"'Shape Limits'!D66","v":0},{"$f":"'Shape Limits'!D65","v":0},null,null,null,null,null,"Casement/U.Maxx/8000/9000",10,10.25,11.5,11.75,{"$f":"(TRUNC(SQRT(SHAPEW+5)*16+0.5)/16)+2.25","v":4.5},12,{"$f":"(TRUNC(SQRT(SHAPEW+5)*16+0.5)/16)+2.25","v":4.5},13,13,20,24,16,16,16,16,18.4375,18,18,18,24,12,16,13,12]
[116,{"$f":"$V$16","v":0},{"$f":"$V$31","v":0},{"$f":"$V$46","v":0},{"$f":"$V$61","v":0},{"$f":"$V$76","v":0},{"$f":"'Shape Limits'!D79","v":0},{"$f":"'Shape Limits'!D78","v":0},null,null,null,null,null,1700,12.5,12.75,12.5,12.75,{"$f":"(TRUNC(SQRT(SHAPEW+5.75)*16+0.5)/16)+3.625","v":6},12,{"$f":"(TRUNC(SQRT(SHAPEW+5.75)*16+0.5)/16)+3.625","v":6},13,15,24,29,18,18,18,18,18.4375,18,18,18,24,12,16,13,12]
[117,{"$f":"$W$16","v":0},{"$f":"$W$31","v":0},{"$f":"$W$46","v":0},{"$f":"$W$61","v":0},{"$f":"$W$76","v":0},{"$f":"'Shape Limits'!J91","v":0},{"$f":"'Shape Limits'!J92","v":0},null,null,null,null,null,1900,12.5,12.75,12.5,12.75,{"$f":"(TRUNC(SQRT(SHAPEW+5.75)*16+0.5)/16)+3.625","v":6},12,{"$f":"(TRUNC(SQRT(SHAPEW+5.75)*16+0.5)/16)+3.625","v":6},13,15,24,29,18,18,18,18,18.4375,18,18,18,24,12,16,13,12]
[118,{"$f":"$X$16","v":0},{"$f":"$X$31","v":0},{"$f":"$X$46","v":0},{"$f":"$X$61","v":0},{"$f":"$X$76","v":0},{"$f":"'Shape Limits'!I98","v":0},{"$f":"'Shape Limits'!I99","v":0},null,null,null,null,null,1901,12.5,12.75,12.5,12.75,{"$f":"(TRUNC(SQRT(SHAPEW+5.75)*16+0.5)/16)+3.625","v":6},12,{"$f":"(TRUNC(SQRT(SHAPEW+5.75)*16+0.5)/16)+3.625","v":6},13,15,24,29,18,18,18,18,18.4375,18,18,18,24,12,16,13,12]
[119,{"$f":"$Y$16","v":0},{"$f":"$Y$31","v":0},{"$f":"$Y$46","v":0},{"$f":"$Y$61","v":0},{"$f":"$Y$76","v":0},{"$f":"'Shape Limits'!U116","v":0},{"$f":"'Shape Limits'!U117","v":0},null,null,null,null,null,"Impact 3100",13.75,14,13.75,null,10.25,11,null,11,null,27.5,null,null,16,null,null,null,null,null,null,null,12,16]
[120,{"$f":"$Z$16","v":0},{"$f":"$Z$31","v":0},{"$f":"$Z$46","v":0},{"$f":"$Z$61","v":0},{"$f":"$Z$76","v":0},{"$f":"'Shape Limits'!J120","v":0},{"$f":"'Shape Limits'!J121","v":0},null,null,null,null,null,"REGENCY Pi7301",12.5,12.75,12.5,12.75,{"$f":"(TRUNC(SQRT(SHAPEW+5.75)*16+0.5)/16)+2.875","v":5.25},12,{"$f":"(TRUNC(SQRT(SHAPEW+5.75)*16+0.5)/16)+2.875","v":5.25},13,15,24,29,18,18,18,18,18.4375,18,18,18,24,12,16,13,12]
[121,{"$f":"$AA$16","v":0},{"$f":"$AA$31","v":0},{"$f":"$AA$46","v":0},{"$f":"$AA$61","v":0},{"$f":"$AA$76","v":0},{"$f":"'Shape Limits'!G130","v":0},{"$f":"'Shape Limits'!G131","v":0},null,null,null,null,null,"I-Series",11.75,12,12,null,{"$f":"(TRUNC(SQRT(SHAPEW+7.25)*16+0.5)/16)+3.5","v":6.1875},11,null,11,null,23.5,null,null,null,16,null,null,null,null,null,null,12,16]
[122,{"$f":"$AB$16","v":0},{"$f":"$AB$31","v":0},{"$f":"$AB$46","v":0},{"$f":"$AB$61","v":0},{"$f":"$AB$76","v":0},{"$f":"'Shape Limits'!I139","v":0},{"$f":"'Shape Limits'!I140","v":0},null,null,null,null,null,"Excalibur / Fusion",11.75,12,12,12.25,{"$f":"(TRUNC(SQRT(SHAPEW+7.25)*16+0.5)/16)+3.5","v":6.1875},11,{"$f":"(TRUNC(SQRT(SHAPEW+7.25)*16+0.5)/16)+3.5","v":6.1875},12,14,23.5,24,16,16,16,16,18.4375,16,16,16,24,12,16,13,12]
[123,{"$f":"$AC$16","v":0},{"$f":"$AC$31","v":0},{"$f":"$AC$46","v":0},{"$f":"$AC$61","v":0},{"$f":"$AC$76","v":0},{"$f":"'Shape Limits'!D154","v":0},{"$f":"'Shape Limits'!D155","v":0},null,null,null,null,null,null,{"$f":"IF(EXT>1,VLOOKUP(EXTRUSION,MINHEIGHTTABLE,2,FALSE),0)","v":0},{"$f":"IF(EXT>1,VLOOKUP(EXTRUSION,MINHEIGHTTABLE,3,FALSE),0)","v":0},{"$f":"IF(EXT>1,VLOOKUP(EXTRUSION,MINHEIGHTTABLE,4,FALSE),0)","v":0},{"$f":"IF(EXT>1,VLOOKUP(EXTRUSION,MINHEIGHTTABLE,5,FALSE),0)","v":0},{"$f":"IF(EXT>1,VLOOKUP(EXTRUSION,MINHEIGHTTABLE,6,FALSE),0)","v":0},{"$f":"IF(EXT>1,VLOOKUP(EXTRUSION,MINHEIGHTTABLE,7,FALSE),0)","v":0},{"$f":"IF(EXT>1,VLOOKUP(EXTRUSION,MINHEIGHTTABLE,8,FALSE),0)","v":0},{"$f":"IF(EXT>1,VLOOKUP(EXTRUSION,MINHEIGHTTABLE,9,FALSE),0)","v":0},{"$f":"IF(EXT>1,VLOOKUP(EXTRUSION,MINHEIGHTTABLE,10,FALSE),0)","v":0},{"$f":"IF(EXT>1,VLOOKUP(EXTRUSION,MINHEIGHTTABLE,11,FALSE),0)","v":0},{"$f":"IF(EXT>1,VLOOKUP(EXTRUSION,MINHEIGHTTABLE,12,FALSE),0)","v":0},{"$f":"IF(EXT>1,VLOOKUP(EXTRUSION,MINHEIGHTTABLE,13,FALSE),0)","v":0},{"$f":"IF(EXT>1,VLOOKUP(EXTRUSION,MINHEIGHTTABLE,14,FALSE),0)","v":0},{"$f":"IF(EXT>1,VLOOKUP(EXTRUSION,MINHEIGHTTABLE,15,FALSE),0)","v":0},{"$f":"IF(EXT>1,VLOOKUP(EXTRUSION,MINHEIGHTTABLE,16,FALSE),0)","v":0},{"$f":"IF(EXT>1,VLOOKUP(EXTRUSION,MINHEIGHTTABLE,17,FALSE),0)","v":0},{"$f":"IF(EXT>1,VLOOKUP(EXTRUSION,MINHEIGHTTABLE,18,FALSE),0)","v":0},{"$f":"IF(EXT>1,VLOOKUP(EXTRUSION,MINHEIGHTTABLE,19,FALSE),0)","v":0},{"$f":"IF(EXT>1,VLOOKUP(EXTRUSION,MINHEIGHTTABLE,20,FALSE),0)","v":0},{"$f":"IF(EXT>1,VLOOKUP(EXTRUSION,MINHEIGHTTABLE,21,FALSE),0)","v":0},{"$f":"IF(EXT>1,VLOOKUP(EXTRUSION,MINHEIGHTTABLE,22,FALSE),0)","v":0},{"$f":"IF(EXT>1,VLOOKUP(EXTRUSION,MINHEIGHTTABLE,23,FALSE),0)","v":0},{"$f":"IF(EXT>1,VLOOKUP(EXTRUSION,MINHEIGHTTABLE,24,FALSE),0)","v":0},{"$f":"IF(EXT>1,VLOOKUP(EXTRUSION,MINHEIGHTTABLE,25,FALSE),0)","v":0}]
[124,{"$f":"$AD$16","v":0},{"$f":"$AD$31","v":0},{"$f":"$AD$46","v":0},{"$f":"$AD$61","v":0},{"$f":"$AD$76","v":0},{"$f":"'Shape Limits'!I163","v":0},{"$f":"'Shape Limits'!I164","v":0},null,null,null,null,null,"Max. Width",105,110,111,112,113,114,115,116,117,118,119,120,121,122,123,124,125,126,127,128,129,130,131,132]
[125,{"$f":"$AE$16","v":0},{"$f":"$AE$31","v":0},{"$f":"$AE$46","v":0},{"$f":"$AE$61","v":0},{"$f":"$AE$76","v":0},{"$f":"'Shape Limits'!G176","v":0},{"$f":"'Shape Limits'!G177","v":0},null,null,null,null,null,"Mezzo",95.5,95.5,72,112,112,112,112,112,112,76,112,76,112,76,112,60,112,112,112,112,112,112,82,112]
[126,{"$f":"$AF$16","v":0},{"$f":"$AF$31","v":0},{"$f":"$AF$46","v":0},{"$f":"$AF$61","v":0},{"$f":"$AF$76","v":0},{"$f":"'Shape Limits'!G188","v":0},{"$f":"'Shape Limits'!G185","v":0},null,null,null,null,null,"Mezzo w/NF",95.5,95.5,72,112,112,112,112,112,112,76,112,76,112,76,112,60,112,112,112,112,112,112,82,112]
[127,{"$f":"$AG$16","v":0},{"$f":"$AG$31","v":0},{"$f":"$AG$46","v":0},{"$f":"$AG$61","v":0},{"$f":"$AG$76","v":0},{"$f":"'Shape Limits'!D199","v":0},{"$f":"'Shape Limits'!D200","v":0},null,null,null,null,null,"New Construction",95,95,72,72,95,95,95,95,95,76,95,76,95,76,95,60,95,95,95,95,95,95,82,95]
[128,{"$f":"$AH$16","v":0},{"$f":"$AH$31","v":0},{"$f":"$AH$46","v":0},{"$f":"$AH$61","v":0},{"$f":"$AH$76","v":0},{"$f":"'Shape Limits'!D210","v":0},{"$f":"'Shape Limits'!D211","v":0},null,null,null,null,null,"New Cons. Gold/Silver",84,84,72,72,84,84,84,84,84,76,84,76,84,76,84,60,84,84,84,84,84,84,71,84]
[129,{"$f":"$AI$16","v":0},{"$f":"$AI$31","v":0},{"$f":"$AI$46","v":0},{"$f":"$AI$61","v":0},{"$f":"$AI$76","v":0},{"$f":"'Shape Limits'!G221","v":0},{"$f":"'Shape Limits'!G222","v":0},null,null,null,null,null,"0700",95.5,95.5,72,72,96,96,96,96,96,76,96,76,96,76,96,60,96,96,96,96,96,96,82,96]
[130,{"$f":"$AJ$16","v":0},{"$f":"$AJ$31","v":0},{"$f":"$AJ$46","v":0},{"$f":"$AJ$61","v":0},{"$f":"$AJ$76","v":0},{"$f":"'Shape Limits'!D236","v":0},{"$f":"'Shape Limits'!G233","v":0},null,null,null,null,null,"Casement/U.Maxx/8000/9000",95.5,95.5,72,72,96,96,96,96,96,76,96,76,96,76,96,60,96,96,96,96,96,96,82,96]
[131,{"$f":"$AK$16","v":0},{"$f":"$AK$31","v":0},{"$f":"$AK$46","v":0},{"$f":"$AK$61","v":0},{"$f":"$AK$76","v":0},{"$f":"'Shape Limits'!D246","v":0},{"$f":"'Shape Limits'!G244","v":0},null,null,null,null,null,1700,95.5,95.5,72,72,72,72,72,72,72,72,72,72,72,76,72,60,72,72,72,72,72,72,71,72]
[132,{"$f":"$AL$16","v":0},{"$f":"$AL$31","v":0},{"$f":"$AL$46","v":0},{"$f":"$AL$61","v":0},{"$f":"$AL$76","v":0},{"$f":"'Shape Limits'!D255","v":0},{"$f":"'Shape Limits'!D256","v":0},null,null,null,null,null,1900,95.5,95.5,72,72,72,72,72,72,72,72,72,72,72,76,72,60,72,72,72,72,72,72,71,72]
[null,null,null,null,null,null,{"$f":"IF(AND(SHAPEW>0,SHAPELINK>1),VLOOKUP(SHAPE,A17:H40,7,FALSE),0)","v":0},{"$f":"IF(AND(SHAPEW>0,SHAPELINK>1),VLOOKUP(SHAPE,A17:H40,8,FALSE),0)","v":0},null,null,null,null,null,1901,95.5,95.5,72,72,72,72,72,72,72,72,72,72,72,76,72,60,72,72,72,72,72,72,71,72]
[null,null,null,null,null,null,null,{"$f":"(GLASS_W*GLASS_H)/144","v":0},null,null,null,null,null,"Impact 3100",76,52.5,52,null,76,76,null,52,null,52,null,null,null,52,null,null,null,null,null,null,52,76]
[null,null,null,null,null,null,null,null,null,null,null,null,null,"REGENCY Pi7301",95.5,95.5,72,72,120,120,120,120,120,76,120,76,120,76,120,60,120,120,120,120,120,120,82,120]
[null,null,null,null,null,null,null,null,null,null,null,null,null,"I-Series",84,52,52,null,84,84,null,52,null,52,null,null,null,52,null,null,null,null,null,null,52,52]
[null,null,null,null,null,null,null,null,null,null,null,null,null,"Excalibur / Fusion",95.5,95.5,72,72,96,96,96,96,96,76,96,76,96,76,96,60,96,96,96,96,96,96,82,96]
[null,null,null,null,null,null,null,null,null,null,null,null,null,null,{"$f":"IF(EXT>1,VLOOKUP(EXTRUSION,MAXWIDTHTABLE,2,FALSE),0)","v":0},{"$f":"IF(EXT>1,VLOOKUP(EXTRUSION,MAXWIDTHTABLE,3,FALSE),0)","v":0},{"$f":"IF(EXT>1,VLOOKUP(EXTRUSION,MAXWIDTHTABLE,4,FALSE),0)","v":0},{"$f":"IF(EXT>1,VLOOKUP(EXTRUSION,MAXWIDTHTABLE,5,FALSE),0)","v":0},{"$f":"IF(EXT>1,VLOOKUP(EXTRUSION,MAXWIDTHTABLE,6,FALSE),0)","v":0},{"$f":"IF(EXT>1,VLOOKUP(EXTRUSION,MAXWIDTHTABLE,7,FALSE),0)","v":0},{"$f":"IF(EXT>1,VLOOKUP(EXTRUSION,MAXWIDTHTABLE,8,FALSE),0)","v":0},{"$f":"IF(EXT>1,VLOOKUP(EXTRUSION,MAXWIDTHTABLE,9,FALSE),0)","v":0},{"$f":"IF(EXT>1,VLOOKUP(EXTRUSION,MAXWIDTHTABLE,10,FALSE),0)","v":0},{"$f":"IF(EXT>1,VLOOKUP(EXTRUSION,MAXWIDTHTABLE,11,FALSE),0)","v":0},{"$f":"IF(EXT>1,VLOOKUP(EXTRUSION,MAXWIDTHTABLE,12,FALSE),0)","v":0},{"$f":"IF(EXT>1,VLOOKUP(EXTRUSION,MAXWIDTHTABLE,13,FALSE),0)","v":0},{"$f":"IF(EXT>1,VLOOKUP(EXTRUSION,MAXWIDTHTABLE,14,FALSE),0)","v":0},{"$f":"IF(EXT>1,VLOOKUP(EXTRUSION,MAXWIDTHTABLE,15,FALSE),0)","v":0},{"$f":"IF(EXT>1,VLOOKUP(EXTRUSION,MAXWIDTHTABLE,16,FALSE),0)","v":0},{"$f":"IF(EXT>1,VLOOKUP(EXTRUSION,MAXWIDTHTABLE,17,FALSE),0)","v":0},{"$f":"IF(EXT>1,VLOOKUP(EXTRUSION,MAXWIDTHTABLE,18,FALSE),0)","v":0},{"$f":"IF(EXT>1,VLOOKUP(EXTRUSION,MAXWIDTHTABLE,19,FALSE),0)","v":0},{"$f":"IF(EXT>1,VLOOKUP(EXTRUSION,MAXWIDTHTABLE,20,FALSE),0)","v":0},{"$f":"IF(EXT>1,VLOOKUP(EXTRUSION,MAXWIDTHTABLE,21,FALSE),0)","v":0},{"$f":"IF(EXT>1,VLOOKUP(EXTRUSION,MAXWIDTHTABLE,22,FALSE),0)","v":0},{"$f":"IF(EXT>1,VLOOKUP(EXTRUSION,MAXWIDTHTABLE,23,FALSE),0)","v":0},{"$f":"IF(EXT>1,VLOOKUP(EXTRUSION,MAXWIDTHTABLE,24,FALSE),0)","v":0},{"$f":"IF(EXT>1,VLOOKUP(EXTRUSION,MAXWIDTHTABLE,25,FALSE),0)","v":0}]
[null,null,null,null,null,null,null,null,null,null,null,null,null,"Max. Height",105,110,111,112,113,114,115,116,117,118,119,120,121,122,123,124,125,126,127,128,129,130,131,132]
[null,null,null,null,null,null,null,null,null,null,null,null,null,"Mezzo",47.75,108,72,108,55,108,108,108,108,76,108,76,108,76,108,90.9375,108,108,108,108,108,108,71,108]
[null,null,null,null,null,null,null,null,null,null,null,null,null,"Mezzo w/NF",47.75,108,72,108,55,108,108,108,108,76,108,76,108,76,108,90.9375,108,108,108,108,108,108,71,108]
[null,null,null,null,null,null,null,null,null,null,null,null,null,"New Construction",47.75,95,72,95,47.5,95,95,95,95,76,95,76,95,76,95,92.9375,95,95,95,95,95,95,71,95]
[null,null,null,null,null,null,null,null,null,null,null,null,null,"New Cons. Gold/Silver",42,84,72,84,41,84,84,84,84,76,84,76,84,76,84,92.9375,84,84,84,84,84,84,71,84]
[null,null,null,null,null,null,null,null,null,null,null,null,null,"0700",47.75,96,72,96,47.5,96,96,96,96,76,96,76,96,76,96,92.9375,96,96,96,96,96,96,71,96]
[null,null,null,null,null,null,null,null,null,null,null,null,null,"Casement/U.Maxx/8000/9000",47.75,96,72,96,47.5,96,96,96,96,76,96,76,96,76,96,92.9375,96,96,96,96,96,96,71,96]
[null,null,null,null,null,null,null,null,null,null,null,null,null,1700,47.75,{"$f":"IF(SHAPEW>54,84,96)","v":96},72,{"$f":"IF(SHAPEW>54,84,96)","v":96},41,{"$f":"IF(SHAPEW>54,84,96)","v":96},96,96,96,76,{"$f":"IF(SHAPEW>54,84,96)","v":96},76,{"$f":"IF(SHAPEW>54,84,96)","v":96},76,{"$f":"IF(SHAPEW>54,84,96)","v":96},92.9375,{"$f":"IF(SHAPEW>54,84,96)","v":96},96,96,96,96,96,71,{"$f":"IF(SHAPEW>54,84,96)","v":96}]
[null,null,null,null,null,null,null,null,null,null,null,null,null,1900,47.75,{"$f":"IF(SHAPEW>54,84,96)","v":96},72,{"$f":"IF(SHAPEW>54,84,96)","v":96},41,96,96,96,96,76,{"$f":"IF(SHAPEW>54,84,96)","v":96},76,{"$f":"IF(SHAPEW>54,84,96)","v":96},76,{"$f":"IF(SHAPEW>54,84,96)","v":96},92.9375,96,96,96,96,96,96,71,{"$f":"IF(SHAPEW>54,84,96)","v":96}]
[null,null,null,null,null,null,null,null,null,null,null,null,null,1901,47.75,{"$f":"IF(SHAPEW>54,84,96)","v":96},72,{"$f":"IF(SHAPEW>54,84,96)","v":96},41,96,96,96,96,76,{"$f":"IF(SHAPEW>54,84,96)","v":96},76,{"$f":"IF(SHAPEW>54,84,96)","v":96},76,{"$f":"IF(SHAPEW>54,84,96)","v":96},92.9375,96,96,96,96,96,96,71,{"$f":"IF(SHAPEW>54,84,96)","v":96}]
[null,null,null,null,null,null,null,null,null,null,null,null,null,"Impact 3100",38,76,52,null,38,76,null,76,null,52,null,null,null,52,null,null,null,null,null,null,76,52]
[null,null,null,null,null,null,null,null,null,null,null,null,null,"REGENCY Pi7301",47.75,108,72,108,47.5,108,108,108,108,76,108,76,108,76,108,92.9375,108,108,108,108,108,108,71,108]
[null,null,null,null,null,null,null,null,null,null,null,null,null,"I-Series",42,84,52,null,41,52,null,84,null,52,null,null,null,52,null,null,null,null,null,null,84,84]
[null,null,null,null,null,null,null,null,null,null,null,null,null,"Excalibur / Fusion",47.75,96,72,108,47.5,108,108,108,108,76,108,76,108,76,108,92.9375,108,108,108,108,108,108,71,108]
[null,null,null,null,null,null,null,null,null,null,null,null,null,null,{"$f":"IF(EXT>1,VLOOKUP(EXTRUSION,MAXHEIGHTTABLE,2,FALSE),0)","v":0},{"$f":"IF(EXT>1,VLOOKUP(EXTRUSION,MAXHEIGHTTABLE,3,FALSE),0)","v":0},{"$f":"IF(EXT>1,VLOOKUP(EXTRUSION,MAXHEIGHTTABLE,4,FALSE),0)","v":0},{"$f":"IF(EXT>1,VLOOKUP(EXTRUSION,MAXHEIGHTTABLE,5,FALSE),0)","v":0},{"$f":"IF(EXT>1,VLOOKUP(EXTRUSION,MAXHEIGHTTABLE,6,FALSE),0)","v":0},{"$f":"IF(EXT>1,VLOOKUP(EXTRUSION,MAXHEIGHTTABLE,7,FALSE),0)","v":0},{"$f":"IF(EXT>1,VLOOKUP(EXTRUSION,MAXHEIGHTTABLE,8,FALSE),0)","v":0},{"$f":"IF(EXT>1,VLOOKUP(EXTRUSION,MAXHEIGHTTABLE,9,FALSE),0)","v":0},{"$f":"IF(EXT>1,VLOOKUP(EXTRUSION,MAXHEIGHTTABLE,10,FALSE),0)","v":0},{"$f":"IF(EXT>1,VLOOKUP(EXTRUSION,MAXHEIGHTTABLE,11,FALSE),0)","v":0},{"$f":"IF(EXT>1,VLOOKUP(EXTRUSION,MAXHEIGHTTABLE,12,FALSE),0)","v":0},{"$f":"IF(EXT>1,VLOOKUP(EXTRUSION,MAXHEIGHTTABLE,13,FALSE),0)","v":0},{"$f":"IF(EXT>1,VLOOKUP(EXTRUSION,MAXHEIGHTTABLE,14,FALSE),0)","v":0},{"$f":"IF(EXT>1,VLOOKUP(EXTRUSION,MAXHEIGHTTABLE,15,FALSE),0)","v":0},{"$f":"IF(EXT>1,VLOOKUP(EXTRUSION,MAXHEIGHTTABLE,16,FALSE),0)","v":0},{"$f":"IF(EXT>1,VLOOKUP(EXTRUSION,MAXHEIGHTTABLE,17,FALSE),0)","v":0},{"$f":"IF(EXT>1,VLOOKUP(EXTRUSION,MAXHEIGHTTABLE,18,FALSE),0)","v":0},{"$f":"IF(EXT>1,VLOOKUP(EXTRUSION,MAXHEIGHTTABLE,19,FALSE),0)","v":0},{"$f":"IF(EXT>1,VLOOKUP(EXTRUSION,MAXHEIGHTTABLE,20,FALSE),0)","v":0},{"$f":"IF(EXT>1,VLOOKUP(EXTRUSION,MAXHEIGHTTABLE,21,FALSE),0)","v":0},{"$f":"IF(EXT>1,VLOOKUP(EXTRUSION,MAXHEIGHTTABLE,22,FALSE),0)","v":0},{"$f":"IF(EXT>1,VLOOKUP(EXTRUSION,MAXHEIGHTTABLE,23,FALSE),0)","v":0},{"$f":"IF(EXT>1,VLOOKUP(EXTRUSION,MAXHEIGHTTABLE,24,FALSE),0)","v":0},{"$f":"IF(EXT>1,VLOOKUP(EXTRUSION,MAXHEIGHTTABLE,25,FALSE),0)","v":0}]
[null,null,null,null,null,null,null,null,null,null,null,null,null,"Max. UI",105,110,111,112,113,114,115,116,117,118,119,120,121,122,123,124,125,126,127,128,129,130,131,132]
[null,null,null,null,null,null,null,null,null,null,null,null,null,"Mezzo",154,154,154,154,154,154,154,154,154,154,154,154,154,154,154,154,154,154,154,154,154,154,154,154]
[null,null,null,null,null,null,null,null,null,null,null,null,null,"Mezzo w/NF",154,154,154,154,154,154,154,154,154,154,154,154,154,154,154,154,154,154,154,154,154,154,154,154]
[null,null,null,null,null,null,null,null,null,null,null,null,null,"New Construction",154,154,154,154,154,154,154,154,154,154,154,154,154,154,154,154,154,154,154,154,154,154,154,154]
[null,null,null,null,null,null,null,null,null,null,null,null,null,"New Cons. Gold/Silver",126,154,154,154,154,154,154,154,154,154,154,154,154,154,154,154,154,154,154,154,154,154,154,154]
[null,null,null,null,null,null,null,null,null,null,null,null,null,"0700",154,154,154,154,154,154,154,154,154,154,154,154,154,154,154,154,154,154,154,154,154,154,154,154]
[null,null,null,null,null,null,null,null,null,null,null,null,null,"Casement/U.Maxx/8000/9000",154,154,154,154,154,154,154,154,154,154,154,154,154,154,154,154,154,154,154,154,154,154,154,154]
[null,null,null,null,null,null,null,null,null,null,null,null,null,1700,156,156,156,156,156,156,156,156,156,156,156,156,156,156,156,156,156,156,156,156,156,156,156,156]
[null,null,null,null,null,null,null,null,null,null,null,null,null,1900,156,156,156,156,156,156,156,156,156,156,156,156,156,156,156,156,156,156,156,156,156,156,156,156]
[null,null,null,null,null,null,null,null,null,null,null,null,null,1901,156,156,156,156,156,156,156,156,156,156,156,156,156,156,156,156,156,156,156,156,156,156,156,156]
[null,null,null,null,null,null,null,null,null,null,null,null,null,"Impact 3100",114,128,114,null,114,128,null,128,null,104,null,null,null,104,null,null,null,null,null,null,128,128]
[null,null,null,null,null,null,null,null,null,null,null,null,null,"REGENCY Pi7301",154,154,154,154,154,154,154,154,154,154,154,154,154,154,154,154,154,154,154,154,154,154,154,154]
[null,null,null,null,null,null,null,null,null,null,null,null,null,"I-Series",126,136,104,null,125,136,null,136,null,104,null,null,null,104,null,null,null,null,null,null,136,136]
[null,null,null,null,null,null,null,null,null,null,null,null,null,"Excalibur / Fusion",154,154,154,154,154,154,154,154,154,154,154,154,154,154,154,154,154,154,154,154,154,154,154,154]
[null,null,null,null,null,null,null,null,null,null,null,null,null,null,{"$f":"IF(EXT>1,VLOOKUP(EXTRUSION,MAXUITABLE,2,FALSE),0)","v":0},{"$f":"IF(EXT>1,VLOOKUP(EXTRUSION,MAXUITABLE,3,FALSE),0)","v":0},{"$f":"IF(EXT>1,VLOOKUP(EXTRUSION,MAXUITABLE,4,FALSE),0)","v":0},{"$f":"IF(EXT>1,VLOOKUP(EXTRUSION,MAXUITABLE,5,FALSE),0)","v":0},{"$f":"IF(EXT>1,VLOOKUP(EXTRUSION,MAXUITABLE,6,FALSE),0)","v":0},{"$f":"IF(EXT>1,VLOOKUP(EXTRUSION,MAXUITABLE,7,FALSE),0)","v":0},{"$f":"IF(EXT>1,VLOOKUP(EXTRUSION,MAXUITABLE,8,FALSE),0)","v":0},{"$f":"IF(EXT>1,VLOOKUP(EXTRUSION,MAXUITABLE,9,FALSE),0)","v":0},{"$f":"IF(EXT>1,VLOOKUP(EXTRUSION,MAXUITABLE,10,FALSE),0)","v":0},{"$f":"IF(EXT>1,VLOOKUP(EXTRUSION,MAXUITABLE,11,FALSE),0)","v":0},{"$f":"IF(EXT>1,VLOOKUP(EXTRUSION,MAXUITABLE,12,FALSE),0)","v":0},{"$f":"IF(EXT>1,VLOOKUP(EXTRUSION,MAXUITABLE,13,FALSE),0)","v":0},{"$f":"IF(EXT>1,VLOOKUP(EXTRUSION,MAXUITABLE,14,FALSE),0)","v":0},{"$f":"IF(EXT>1,VLOOKUP(EXTRUSION,MAXUITABLE,15,FALSE),0)","v":0},{"$f":"IF(EXT>1,VLOOKUP(EXTRUSION,MAXUITABLE,16,FALSE),0)","v":0},{"$f":"IF(EXT>1,VLOOKUP(EXTRUSION,MAXUITABLE,17,FALSE),0)","v":0},{"$f":"IF(EXT>1,VLOOKUP(EXTRUSION,MAXUITABLE,18,FALSE),0)","v":0},{"$f":"IF(EXT>1,VLOOKUP(EXTRUSION,MAXUITABLE,19,FALSE),0)","v":0},{"$f":"IF(EXT>1,VLOOKUP(EXTRUSION,MAXUITABLE,20,FALSE),0)","v":0},{"$f":"IF(EXT>1,VLOOKUP(EXTRUSION,MAXUITABLE,21,FALSE),0)","v":0},{"$f":"IF(EXT>1,VLOOKUP(EXTRUSION,MAXUITABLE,22,FALSE),0)","v":0},{"$f":"IF(EXT>1,VLOOKUP(EXTRUSION,MAXUITABLE,23,FALSE),0)","v":0},{"$f":"IF(EXT>1,VLOOKUP(EXTRUSION,MAXUITABLE,24,FALSE),0)","v":0},{"$f":"IF(EXT>1,VLOOKUP(EXTRUSION,MAXUITABLE,25,FALSE),0)","v":0}]